{
  "data_qualities": {
    "quality": [
      {
        "name": "AutoCorrelation",
        "value": "1.0"
      },
      {
        "name": "ClassEntropy",
        "value": []
      },
      {
        "name": "Dimensionality",
        "value": "0.04672897196261682"
      },
      {
        "name": "EquivalentNumberOfAtts",
        "value": []
      },
      {
        "name": "MajorityClassPercentage",
        "value": "93.92523364485982"
      },
      {
        "name": "MajorityClassSize",
        "value": "201.0"
      },
      {
        "name": "MaxAttributeEntropy",
        "value": []
      },
      {
        "name": "MaxKurtosisOfNumericAtts",
        "value": "54.68522715478338"
      },
      {
        "name": "MaxMeansOfNumericAtts",
        "value": "72.65564859813084"
      },
      {
        "name": "MaxMutualInformation",
        "value": []
      },
      {
        "name": "MaxNominalAttDistinctValues",
        "value": []
      },
      {
        "name": "MaxSkewnessOfNumericAtts",
        "value": "6.551267298529309"
      },
      {
        "name": "MaxStdDevOfNumericAtts",
        "value": "1.4423417782329389"
      },
      {
        "name": "MeanAttributeEntropy",
        "value": []
      },
      {
        "name": "MeanKurtosisOfNumericAtts",
        "value": "10.938896570341162"
      },
      {
        "name": "MeanMeansOfNumericAtts",
        "value": "11.266086894008307"
      },
      {
        "name": "MeanMutualInformation",
        "value": []
      },
      {
        "name": "MeanNoiseToSignalRatio",
        "value": []
      },
      {
        "name": "MeanNominalAttDistinctValues",
        "value": []
      },
      {
        "name": "MeanSkewnessOfNumericAtts",
        "value": "1.8246113759212415"
      },
      {
        "name": "MeanStdDevOfNumericAtts",
        "value": "0.6902660905079514"
      },
      {
        "name": "MinAttributeEntropy",
        "value": []
      },
      {
        "name": "MinKurtosisOfNumericAtts",
        "value": "-0.40990538361143125"
      },
      {
        "name": "MinMeansOfNumericAtts",
        "value": "0.042611214953271026"
      },
      {
        "name": "MinMutualInformation",
        "value": []
      },
      {
        "name": "MinNominalAttDistinctValues",
        "value": []
      },
      {
        "name": "MinSkewnessOfNumericAtts",
        "value": "-1.152751308494733"
      },
      {
        "name": "MinStdDevOfNumericAtts",
        "value": "0.0030366531374610498"
      },
      {
        "name": "MinorityClassPercentage",
        "value": "6.074766355140187"
      },
      {
        "name": "MinorityClassSize",
        "value": "13.0"
      },
      {
        "name": "NumberOfBinaryFeatures",
        "value": "0.0"
      },
      {
        "name": "NumberOfClasses",
        "value": "2.0"
      },
      {
        "name": "NumberOfFeatures",
        "value": "10.0"
      },
      {
        "name": "NumberOfInstances",
        "value": "214.0"
      },
      {
        "name": "NumberOfInstancesWithMissingValues",
        "value": "0.0"
      },
      {
        "name": "NumberOfMissingValues",
        "value": "0.0"
      },
      {
        "name": "NumberOfNumericFeatures",
        "value": "9.0"
      },
      {
        "name": "NumberOfSymbolicFeatures",
        "value": "0.0"
      },
      {
        "name": "PercentageOfBinaryFeatures",
        "value": "0.0"
      },
      {
        "name": "PercentageOfInstancesWithMissingValues",
        "value": "0.0"
      },
      {
        "name": "PercentageOfMissingValues",
        "value": "0.0"
      },
      {
        "name": "PercentageOfNumericFeatures",
        "value": "90.0"
      },
      {
        "name": "PercentageOfSymbolicFeatures",
        "value": "0.0"
      },
      {
        "name": "Quartile1AttributeEntropy",
        "value": []
      },
      {
        "name": "Quartile1KurtosisOfNumericAtts",
        "value": "2.4679994313952798"
      },
      {
        "name": "Quartile1MeansOfNumericAtts",
        "value": "0.33739906542056086"
      },
      {
        "name": "Quartile1MutualInformation",
        "value": []
      },
      {
        "name": "Quartile1SkewnessOfNumericAtts",
        "value": "-0.13855552366724644"
      },
      {
        "name": "Quartile1StdDevOfNumericAtts",
        "value": "0.29519949463338874"
      },
      {
        "name": "Quartile2AttributeEntropy",
        "value": []
      },
      {
        "name": "Quartile2KurtosisOfNumericAtts",
        "value": "4.93070351290269"
      },
      {
        "name": "Quartile2MeansOfNumericAtts",
        "value": "1.5183658311214954"
      },
      {
        "name": "Quartile2MutualInformation",
        "value": []
      },
      {
        "name": "Quartile2SkewnessOfNumericAtts",
        "value": "1.6249402354379794"
      },
      {
        "name": "Quartile2StdDevOfNumericAtts",
        "value": "0.6521875618541384"
      },
      {
        "name": "Quartile3AttributeEntropy",
        "value": []
      },
      {
        "name": "Quartile3KurtosisOfNumericAtts",
        "value": "12.372473046911374"
      },
      {
        "name": "Quartile3MeansOfNumericAtts",
        "value": "11.186973411214954"
      },
      {
        "name": "Quartile3MutualInformation",
        "value": []
      },
      {
        "name": "Quartile3SkewnessOfNumericAtts",
        "value": "3.3679406623638757"
      },
      {
        "name": "Quartile3StdDevOfNumericAtts",
        "value": "1.1232075575881744"
      },
      {
        "name": "StdvNominalAttDistinctValues",
        "value": []
      }
    ]
  }
}