{
  "data_qualities": {
    "quality": [
      {
        "name": "AutoCorrelation",
        "value": "0.9037430918283584"
      },
      {
        "name": "ClassEntropy",
        "value": []
      },
      {
        "name": "Dimensionality",
        "value": "0.002504444212067343"
      },
      {
        "name": "EquivalentNumberOfAtts",
        "value": []
      },
      {
        "name": "MajorityClassPercentage",
        "value": []
      },
      {
        "name": "MajorityClassSize",
        "value": []
      },
      {
        "name": "MaxAttributeEntropy",
        "value": []
      },
      {
        "name": "MaxKurtosisOfNumericAtts",
        "value": "81408.20949941195"
      },
      {
        "name": "MaxMeansOfNumericAtts",
        "value": "15750.03669350624"
      },
      {
        "name": "MaxMutualInformation",
        "value": []
      },
      {
        "name": "MaxNominalAttDistinctValues",
        "value": "25847.0"
      },
      {
        "name": "MaxSkewnessOfNumericAtts",
        "value": "242.10291818127004"
      },
      {
        "name": "MaxStdDevOfNumericAtts",
        "value": "8534.462013368717"
      },
      {
        "name": "MeanAttributeEntropy",
        "value": []
      },
      {
        "name": "MeanKurtosisOfNumericAtts",
        "value": "587.1020489746267"
      },
      {
        "name": "MeanMeansOfNumericAtts",
        "value": "91.53016279255573"
      },
      {
        "name": "MeanMutualInformation",
        "value": []
      },
      {
        "name": "MeanNoiseToSignalRatio",
        "value": []
      },
      {
        "name": "MeanNominalAttDistinctValues",
        "value": "244.9242424242421"
      },
      {
        "name": "MeanSkewnessOfNumericAtts",
        "value": "5.392899452233042"
      },
      {
        "name": "MeanStdDevOfNumericAtts",
        "value": "68.96915134972464"
      },
      {
        "name": "MinAttributeEntropy",
        "value": []
      },
      {
        "name": "MinKurtosisOfNumericAtts",
        "value": "-1.9999639104879299"
      },
      {
        "name": "MinMeansOfNumericAtts",
        "value": "0.005854526720059825"
      },
      {
        "name": "MinMutualInformation",
        "value": []
      },
      {
        "name": "MinNominalAttDistinctValues",
        "value": "1.0"
      },
      {
        "name": "MinSkewnessOfNumericAtts",
        "value": "-10.430316607487205"
      },
      {
        "name": "MinStdDevOfNumericAtts",
        "value": "0.07796102602800896"
      },
      {
        "name": "MinorityClassPercentage",
        "value": []
      },
      {
        "name": "MinorityClassSize",
        "value": []
      },
      {
        "name": "NumberOfBinaryFeatures",
        "value": "28.0"
      },
      {
        "name": "NumberOfClasses",
        "value": "0.0"
      },
      {
        "name": "NumberOfFeatures",
        "value": "479.0"
      },
      {
        "name": "NumberOfInstances",
        "value": "191260.0"
      },
      {
        "name": "NumberOfInstancesWithMissingValues",
        "value": "191260.0"
      },
      {
        "name": "NumberOfMissingValues",
        "value": "5587563.0"
      },
      {
        "name": "NumberOfNumericFeatures",
        "value": "347.0"
      },
      {
        "name": "NumberOfSymbolicFeatures",
        "value": "132.0"
      },
      {
        "name": "PercentageOfBinaryFeatures",
        "value": "5.845511482254697"
      },
      {
        "name": "PercentageOfInstancesWithMissingValues",
        "value": "100.0"
      },
      {
        "name": "PercentageOfMissingValues",
        "value": "6.099058064997815"
      },
      {
        "name": "PercentageOfNumericFeatures",
        "value": "72.44258872651356"
      },
      {
        "name": "PercentageOfSymbolicFeatures",
        "value": "27.55741127348643"
      },
      {
        "name": "Quartile1AttributeEntropy",
        "value": []
      },
      {
        "name": "Quartile1KurtosisOfNumericAtts",
        "value": "2.473067733810448"
      },
      {
        "name": "Quartile1MeansOfNumericAtts",
        "value": "3.4395482589145314"
      },
      {
        "name": "Quartile1MutualInformation",
        "value": []
      },
      {
        "name": "Quartile1SkewnessOfNumericAtts",
        "value": "0.3550928898478701"
      },
      {
        "name": "Quartile1StdDevOfNumericAtts",
        "value": "3.927784836936997"
      },
      {
        "name": "Quartile2AttributeEntropy",
        "value": []
      },
      {
        "name": "Quartile2KurtosisOfNumericAtts",
        "value": "10.892648907023482"
      },
      {
        "name": "Quartile2MeansOfNumericAtts",
        "value": "12.289156122555715"
      },
      {
        "name": "Quartile2MutualInformation",
        "value": []
      },
      {
        "name": "Quartile2SkewnessOfNumericAtts",
        "value": "1.9861559741041852"
      },
      {
        "name": "Quartile2StdDevOfNumericAtts",
        "value": "7.597752056978029"
      },
      {
        "name": "Quartile3AttributeEntropy",
        "value": []
      },
      {
        "name": "Quartile3KurtosisOfNumericAtts",
        "value": "42.3194847345677"
      },
      {
        "name": "Quartile3MeansOfNumericAtts",
        "value": "29.157513332636015"
      },
      {
        "name": "Quartile3MutualInformation",
        "value": []
      },
      {
        "name": "Quartile3SkewnessOfNumericAtts",
        "value": "4.587685695219361"
      },
      {
        "name": "Quartile3StdDevOfNumericAtts",
        "value": "13.433949096673857"
      },
      {
        "name": "StdvNominalAttDistinctValues",
        "value": "2249.0410666343596"
      }
    ]
  }
}