{
  "data_qualities": {
    "quality": [
      {
        "name": "AutoCorrelation",
        "value": "-1.997437364632827"
      },
      {
        "name": "ClassEntropy",
        "value": []
      },
      {
        "name": "Dimensionality",
        "value": "3.0433757123401278E-5"
      },
      {
        "name": "EquivalentNumberOfAtts",
        "value": []
      },
      {
        "name": "MajorityClassPercentage",
        "value": []
      },
      {
        "name": "MajorityClassSize",
        "value": []
      },
      {
        "name": "MaxAttributeEntropy",
        "value": []
      },
      {
        "name": "MaxKurtosisOfNumericAtts",
        "value": "67.72556916675173"
      },
      {
        "name": "MaxMeansOfNumericAtts",
        "value": "53.039912049155404"
      },
      {
        "name": "MaxMutualInformation",
        "value": []
      },
      {
        "name": "MaxNominalAttDistinctValues",
        "value": "53.0"
      },
      {
        "name": "MaxSkewnessOfNumericAtts",
        "value": "4.184649398386025"
      },
      {
        "name": "MaxStdDevOfNumericAtts",
        "value": "42.75265883082294"
      },
      {
        "name": "MeanAttributeEntropy",
        "value": []
      },
      {
        "name": "MeanKurtosisOfNumericAtts",
        "value": "22.81008338912543"
      },
      {
        "name": "MeanMeansOfNumericAtts",
        "value": "22.06434669904883"
      },
      {
        "name": "MeanMutualInformation",
        "value": []
      },
      {
        "name": "MeanNoiseToSignalRatio",
        "value": []
      },
      {
        "name": "MeanNominalAttDistinctValues",
        "value": "21.2"
      },
      {
        "name": "MeanSkewnessOfNumericAtts",
        "value": "1.7502844332181426"
      },
      {
        "name": "MeanStdDevOfNumericAtts",
        "value": "12.374104763610543"
      },
      {
        "name": "MinAttributeEntropy",
        "value": []
      },
      {
        "name": "MinKurtosisOfNumericAtts",
        "value": "-1.2105328598670273"
      },
      {
        "name": "MinMeansOfNumericAtts",
        "value": "-2.0408633563155463"
      },
      {
        "name": "MinMutualInformation",
        "value": []
      },
      {
        "name": "MinNominalAttDistinctValues",
        "value": "4.0"
      },
      {
        "name": "MinSkewnessOfNumericAtts",
        "value": "-0.6333829046517961"
      },
      {
        "name": "MinStdDevOfNumericAtts",
        "value": "1.7035243498461303"
      },
      {
        "name": "MinorityClassPercentage",
        "value": []
      },
      {
        "name": "MinorityClassSize",
        "value": []
      },
      {
        "name": "NumberOfBinaryFeatures",
        "value": "0.0"
      },
      {
        "name": "NumberOfClasses",
        "value": "0.0"
      },
      {
        "name": "NumberOfFeatures",
        "value": "12.0"
      },
      {
        "name": "NumberOfInstances",
        "value": "394299.0"
      },
      {
        "name": "NumberOfInstancesWithMissingValues",
        "value": "0.0"
      },
      {
        "name": "NumberOfMissingValues",
        "value": "0.0"
      },
      {
        "name": "NumberOfNumericFeatures",
        "value": "6.0"
      },
      {
        "name": "NumberOfSymbolicFeatures",
        "value": "5.0"
      },
      {
        "name": "PercentageOfBinaryFeatures",
        "value": "0.0"
      },
      {
        "name": "PercentageOfInstancesWithMissingValues",
        "value": "0.0"
      },
      {
        "name": "PercentageOfMissingValues",
        "value": "0.0"
      },
      {
        "name": "PercentageOfNumericFeatures",
        "value": "50.0"
      },
      {
        "name": "PercentageOfSymbolicFeatures",
        "value": "41.66666666666667"
      },
      {
        "name": "Quartile1AttributeEntropy",
        "value": []
      },
      {
        "name": "Quartile1KurtosisOfNumericAtts",
        "value": "-0.9583949042708315"
      },
      {
        "name": "Quartile1MeansOfNumericAtts",
        "value": "6.737977129962122"
      },
      {
        "name": "Quartile1MutualInformation",
        "value": []
      },
      {
        "name": "Quartile1SkewnessOfNumericAtts",
        "value": "-0.1576195530558019"
      },
      {
        "name": "Quartile1StdDevOfNumericAtts",
        "value": "1.7431202606203582"
      },
      {
        "name": "Quartile2AttributeEntropy",
        "value": []
      },
      {
        "name": "Quartile2KurtosisOfNumericAtts",
        "value": "5.547718705471477"
      },
      {
        "name": "Quartile2MeansOfNumericAtts",
        "value": "13.203000956127369"
      },
      {
        "name": "Quartile2MutualInformation",
        "value": []
      },
      {
        "name": "Quartile2SkewnessOfNumericAtts",
        "value": "1.5849220042472842"
      },
      {
        "name": "Quartile2StdDevOfNumericAtts",
        "value": "8.148872236797509"
      },
      {
        "name": "Quartile3AttributeEntropy",
        "value": []
      },
      {
        "name": "Quartile3KurtosisOfNumericAtts",
        "value": "62.0246739436857"
      },
      {
        "name": "Quartile3MeansOfNumericAtts",
        "value": "47.24755723514663"
      },
      {
        "name": "Quartile3MutualInformation",
        "value": []
      },
      {
        "name": "Quartile3SkewnessOfNumericAtts",
        "value": "3.880883249299403"
      },
      {
        "name": "Quartile3StdDevOfNumericAtts",
        "value": "19.488951230096283"
      },
      {
        "name": "StdvNominalAttDistinctValues",
        "value": "20.437710243566915"
      }
    ]
  }
}