{
  "data_set_description": {
    "default_target_attribute": "y",
    "description": "The classical XOR problem, encoded with numeric variables",
    "description_version": "1",
    "file_id": "19336174",
    "format": "ARFF",
    "id": "41195",
    "licence": "CC0",
    "md5_checksum": "26ba75a80dceb84d74a0990294c7354d",
    "minio_url": "https://data.openml.org/datasets/0004/41195/dataset_41195.pq",
    "name": "xor",
    "parquet_url": "https://data.openml.org/datasets/0004/41195/dataset_41195.pq",
    "processing_date": "2018-10-03 21:16:34",
    "status": "in_preparation",
    "upload_date": "2018-10-03T20:43:07",
    "url": "https://api.openml.org/data/v1/download/19336174/xor.arff",
    "version": "3",
    "visibility": "public"
  }
}