{
  "data_set_description": {
    "creator": [
      "Carvana",
      "Kaggle"
    ],
    "default_target_attribute": "IsBadBuy",
    "description": "One of the biggest challenges of an auto dealership purchasing a used car at an auto auction is the risk of that the vehicle might have serious issues that prevent it from being sold to customers. The auto community calls these unfortunate purchases &quot;kicks&quot;.\n\nKicked cars often result when there are tampered odometers, mechanical issues the dealer is not able to address, issues with getting the vehicle title from the seller, or some other unforeseen problem. Kick cars can be very costly to dealers after transportation cost, throw-away repair work, and market losses in reselling the vehicle.\n\nModelers who can figure out which cars have a higher risk of being kick can provide real value to dealerships trying to provide the best inventory selection possible to their customers.\n\nThe challenge of this competition is to predict if the car purchased at the Auction is a Kick (bad buy).",
    "description_version": "1",
    "file_id": "19335679",
    "format": "ARFF",
    "id": "41162",
    "licence": "CC0",
    "md5_checksum": "41360a49eb0efcb1ba67ea12f939ae4e",
    "minio_url": "https://data.openml.org/datasets/0004/41162/dataset_41162.pq",
    "name": "kick",
    "original_data_url": "https://www.kaggle.com/salilchitnis/carvana",
    "parquet_url": "https://data.openml.org/datasets/0004/41162/dataset_41162.pq",
    "processing_date": "2021-08-23 16:33:42",
    "status": "active",
    "tag": [
      "Automobile",
      "chalearn",
      "Transportation"
    ],
    "upload_date": "2018-08-16T01:30:19",
    "url": "https://api.openml.org/data/v1/download/19335679/kick.arff",
    "version": "1",
    "visibility": "public"
  }
}