{
  "data_qualities": {
    "quality": [
      {
        "name": "AutoCorrelation",
        "value": "0.4979292768397579"
      },
      {
        "name": "ClassEntropy",
        "value": "0.9999762953997442"
      },
      {
        "name": "Dimensionality",
        "value": "0.08280254777070063"
      },
      {
        "name": "EquivalentNumberOfAtts",
        "value": []
      },
      {
        "name": "MajorityClassPercentage",
        "value": "50.28662420382166"
      },
      {
        "name": "MajorityClassSize",
        "value": "1579.0"
      },
      {
        "name": "MaxAttributeEntropy",
        "value": []
      },
      {
        "name": "MaxKurtosisOfNumericAtts",
        "value": "0.4757890015347712"
      },
      {
        "name": "MaxMeansOfNumericAtts",
        "value": "517.3089171974523"
      },
      {
        "name": "MaxMutualInformation",
        "value": []
      },
      {
        "name": "MaxNominalAttDistinctValues",
        "value": "2.0"
      },
      {
        "name": "MaxSkewnessOfNumericAtts",
        "value": "0.19027502979127942"
      },
      {
        "name": "MaxStdDevOfNumericAtts",
        "value": "133.56921896379617"
      },
      {
        "name": "MeanAttributeEntropy",
        "value": []
      },
      {
        "name": "MeanKurtosisOfNumericAtts",
        "value": "0.062025019584213435"
      },
      {
        "name": "MeanMeansOfNumericAtts",
        "value": "488.48474165703465"
      },
      {
        "name": "MeanMutualInformation",
        "value": []
      },
      {
        "name": "MeanNoiseToSignalRatio",
        "value": []
      },
      {
        "name": "MeanNominalAttDistinctValues",
        "value": "2.0"
      },
      {
        "name": "MeanSkewnessOfNumericAtts",
        "value": "0.034018304345035416"
      },
      {
        "name": "MeanStdDevOfNumericAtts",
        "value": "25.857705619633016"
      },
      {
        "name": "MinAttributeEntropy",
        "value": []
      },
      {
        "name": "MinKurtosisOfNumericAtts",
        "value": "-0.9629973289703022"
      },
      {
        "name": "MinMeansOfNumericAtts",
        "value": "475.8971337579618"
      },
      {
        "name": "MinMutualInformation",
        "value": []
      },
      {
        "name": "MinNominalAttDistinctValues",
        "value": "2.0"
      },
      {
        "name": "MinSkewnessOfNumericAtts",
        "value": "-0.12016312432465297"
      },
      {
        "name": "MinStdDevOfNumericAtts",
        "value": "0.9395838800621169"
      },
      {
        "name": "MinorityClassPercentage",
        "value": "49.71337579617835"
      },
      {
        "name": "MinorityClassSize",
        "value": "1561.0"
      },
      {
        "name": "NumberOfBinaryFeatures",
        "value": "1.0"
      },
      {
        "name": "NumberOfClasses",
        "value": "2.0"
      },
      {
        "name": "NumberOfFeatures",
        "value": "260.0"
      },
      {
        "name": "NumberOfInstances",
        "value": "3140.0"
      },
      {
        "name": "NumberOfInstancesWithMissingValues",
        "value": "0.0"
      },
      {
        "name": "NumberOfMissingValues",
        "value": "0.0"
      },
      {
        "name": "NumberOfNumericFeatures",
        "value": "259.0"
      },
      {
        "name": "NumberOfSymbolicFeatures",
        "value": "1.0"
      },
      {
        "name": "PercentageOfBinaryFeatures",
        "value": "0.38461538461538464"
      },
      {
        "name": "PercentageOfInstancesWithMissingValues",
        "value": "0.0"
      },
      {
        "name": "PercentageOfMissingValues",
        "value": "0.0"
      },
      {
        "name": "PercentageOfNumericFeatures",
        "value": "99.61538461538461"
      },
      {
        "name": "PercentageOfSymbolicFeatures",
        "value": "0.38461538461538464"
      },
      {
        "name": "Quartile1AttributeEntropy",
        "value": []
      },
      {
        "name": "Quartile1KurtosisOfNumericAtts",
        "value": "0.025711804976618957"
      },
      {
        "name": "Quartile1MeansOfNumericAtts",
        "value": "480.3630573248408"
      },
      {
        "name": "Quartile1MutualInformation",
        "value": []
      },
      {
        "name": "Quartile1SkewnessOfNumericAtts",
        "value": "-0.0027496942027410414"
      },
      {
        "name": "Quartile1StdDevOfNumericAtts",
        "value": "11.690622436486434"
      },
      {
        "name": "Quartile2AttributeEntropy",
        "value": []
      },
      {
        "name": "Quartile2KurtosisOfNumericAtts",
        "value": "0.08909783763909962"
      },
      {
        "name": "Quartile2MeansOfNumericAtts",
        "value": "485.5210191082803"
      },
      {
        "name": "Quartile2MutualInformation",
        "value": []
      },
      {
        "name": "Quartile2SkewnessOfNumericAtts",
        "value": "0.038466878065569525"
      },
      {
        "name": "Quartile2StdDevOfNumericAtts",
        "value": "22.124405317777256"
      },
      {
        "name": "Quartile3AttributeEntropy",
        "value": []
      },
      {
        "name": "Quartile3KurtosisOfNumericAtts",
        "value": "0.1797059377056831"
      },
      {
        "name": "Quartile3MeansOfNumericAtts",
        "value": "495.78312101910825"
      },
      {
        "name": "Quartile3MutualInformation",
        "value": []
      },
      {
        "name": "Quartile3SkewnessOfNumericAtts",
        "value": "0.07036799991879265"
      },
      {
        "name": "Quartile3StdDevOfNumericAtts",
        "value": "36.533501474152075"
      },
      {
        "name": "StdvNominalAttDistinctValues",
        "value": "0.0"
      }
    ]
  }
}