{
  "data_set_description": {
    "description": "#titanic",
    "description_version": "1",
    "file_id": "19335426",
    "format": "ARFF",
    "id": "41122",
    "licence": "CC0",
    "md5_checksum": "60ac7205eee0ba5045c90b3bba95b1c4",
    "minio_url": "https://data.openml.org/datasets/0004/41122/dataset_41122.pq",
    "name": "TitanicTestData",
    "parquet_url": "https://data.openml.org/datasets/0004/41122/dataset_41122.pq",
    "processing_date": "2018-10-31 02:39:24",
    "status": "in_preparation",
    "tag": [
      ">10000",
      "TestDataSet",
      "Titanic"
    ],
    "upload_date": "2018-08-02T14:39:42",
    "url": "https://api.openml.org/data/v1/download/19335426/TitanicTestData.arff",
    "version": "1",
    "visibility": "public"
  }
}