{
  "data_features": {
    "feature": [
      {
        "data_type": "numeric",
        "index": "0",
        "is_ignore": "false",
        "is_row_identifier": "false",
        "is_target": "false",
        "name": "0",
        "number_of_missing_values": "0"
      },
      {
        "data_type": "numeric",
        "index": "1",
        "is_ignore": "false",
        "is_row_identifier": "false",
        "is_target": "false",
        "name": "1",
        "number_of_missing_values": "0"
      },
      {
        "data_type": "numeric",
        "index": "2",
        "is_ignore": "false",
        "is_row_identifier": "false",
        "is_target": "false",
        "name": "2",
        "number_of_missing_values": "0"
      },
      {
        "data_type": "numeric",
        "index": "3",
        "is_ignore": "false",
        "is_row_identifier": "false",
        "is_target": "false",
        "name": "3",
        "number_of_missing_values": "0"
      },
      {
        "data_type": "numeric",
        "index": "4",
        "is_ignore": "false",
        "is_row_identifier": "false",
        "is_target": "false",
        "name": "4",
        "number_of_missing_values": "0"
      },
      {
        "data_type": "numeric",
        "index": "5",
        "is_ignore": "false",
        "is_row_identifier": "false",
        "is_target": "false",
        "name": "5",
        "number_of_missing_values": "0"
      },
      {
        "data_type": "numeric",
        "index": "6",
        "is_ignore": "false",
        "is_row_identifier": "false",
        "is_target": "false",
        "name": "6",
        "number_of_missing_values": "0"
      },
      {
        "data_type": "numeric",
        "index": "7",
        "is_ignore": "false",
        "is_row_identifier": "false",
        "is_target": "false",
        "name": "7",
        "number_of_missing_values": "0"
      },
      {
        "data_type": "numeric",
        "index": "8",
        "is_ignore": "false",
        "is_row_identifier": "false",
        "is_target": "false",
        "name": "8",
        "number_of_missing_values": "0"
      },
      {
        "data_type": "numeric",
        "index": "9",
        "is_ignore": "false",
        "is_row_identifier": "false",
        "is_target": "false",
        "name": "9",
        "number_of_missing_values": "0"
      },
      {
        "data_type": "numeric",
        "index": "10",
        "is_ignore": "false",
        "is_row_identifier": "false",
        "is_target": "false",
        "name": "10",
        "number_of_missing_values": "0"
      },
      {
        "data_type": "numeric",
        "index": "11",
        "is_ignore": "false",
        "is_row_identifier": "false",
        "is_target": "false",
        "name": "11",
        "number_of_missing_values": "0"
      },
      {
        "data_type": "numeric",
        "index": "12",
        "is_ignore": "false",
        "is_row_identifier": "false",
        "is_target": "false",
        "name": "12",
        "number_of_missing_values": "0"
      },
      {
        "data_type": "numeric",
        "index": "13",
        "is_ignore": "false",
        "is_row_identifier": "false",
        "is_target": "false",
        "name": "13",
        "number_of_missing_values": "0"
      },
      {
        "data_type": "numeric",
        "index": "14",
        "is_ignore": "false",
        "is_row_identifier": "false",
        "is_target": "false",
        "name": "14",
        "number_of_missing_values": "0"
      },
      {
        "data_type": "numeric",
        "index": "15",
        "is_ignore": "false",
        "is_row_identifier": "false",
        "is_target": "false",
        "name": "15",
        "number_of_missing_values": "0"
      },
      {
        "data_type": "numeric",
        "index": "16",
        "is_ignore": "false",
        "is_row_identifier": "false",
        "is_target": "false",
        "name": "16",
        "number_of_missing_values": "0"
      },
      {
        "data_type": "numeric",
        "index": "17",
        "is_ignore": "false",
        "is_row_identifier": "false",
        "is_target": "false",
        "name": "17",
        "number_of_missing_values": "0"
      },
      {
        "data_type": "numeric",
        "index": "18",
        "is_ignore": "false",
        "is_row_identifier": "false",
        "is_target": "false",
        "name": "18",
        "number_of_missing_values": "0"
      },
      {
        "data_type": "numeric",
        "index": "19",
        "is_ignore": "false",
        "is_row_identifier": "false",
        "is_target": "false",
        "name": "19",
        "number_of_missing_values": "0"
      },
      {
        "data_type": "numeric",
        "index": "20",
        "is_ignore": "false",
        "is_row_identifier": "false",
        "is_target": "false",
        "name": "20",
        "number_of_missing_values": "0"
      },
      {
        "data_type": "numeric",
        "index": "21",
        "is_ignore": "false",
        "is_row_identifier": "false",
        "is_target": "false",
        "name": "21",
        "number_of_missing_values": "0"
      },
      {
        "data_type": "numeric",
        "index": "22",
        "is_ignore": "false",
        "is_row_identifier": "false",
        "is_target": "false",
        "name": "22",
        "number_of_missing_values": "0"
      },
      {
        "data_type": "numeric",
        "index": "23",
        "is_ignore": "false",
        "is_row_identifier": "false",
        "is_target": "false",
        "name": "23",
        "number_of_missing_values": "0"
      },
      {
        "data_type": "numeric",
        "index": "24",
        "is_ignore": "false",
        "is_row_identifier": "false",
        "is_target": "false",
        "name": "24",
        "number_of_missing_values": "0"
      },
      {
        "data_type": "numeric",
        "index": "25",
        "is_ignore": "false",
        "is_row_identifier": "false",
        "is_target": "false",
        "name": "25",
        "number_of_missing_values": "0"
      },
      {
        "data_type": "numeric",
        "index": "26",
        "is_ignore": "false",
        "is_row_identifier": "false",
        "is_target": "false",
        "name": "26",
        "number_of_missing_values": "0"
      },
      {
        "data_type": "numeric",
        "index": "27",
        "is_ignore": "false",
        "is_row_identifier": "false",
        "is_target": "false",
        "name": "27",
        "number_of_missing_values": "0"
      },
      {
        "data_type": "numeric",
        "index": "28",
        "is_ignore": "false",
        "is_row_identifier": "false",
        "is_target": "false",
        "name": "28",
        "number_of_missing_values": "0"
      },
      {
        "data_type": "numeric",
        "index": "29",
        "is_ignore": "false",
        "is_row_identifier": "false",
        "is_target": "false",
        "name": "29",
        "number_of_missing_values": "0"
      },
      {
        "data_type": "numeric",
        "index": "30",
        "is_ignore": "false",
        "is_row_identifier": "false",
        "is_target": "false",
        "name": "30",
        "number_of_missing_values": "0"
      },
      {
        "data_type": "numeric",
        "index": "31",
        "is_ignore": "false",
        "is_row_identifier": "false",
        "is_target": "false",
        "name": "31",
        "number_of_missing_values": "0"
      },
      {
        "data_type": "numeric",
        "index": "32",
        "is_ignore": "false",
        "is_row_identifier": "false",
        "is_target": "false",
        "name": "32",
        "number_of_missing_values": "0"
      },
      {
        "data_type": "numeric",
        "index": "33",
        "is_ignore": "false",
        "is_row_identifier": "false",
        "is_target": "false",
        "name": "33",
        "number_of_missing_values": "0"
      },
      {
        "data_type": "numeric",
        "index": "34",
        "is_ignore": "false",
        "is_row_identifier": "false",
        "is_target": "false",
        "name": "34",
        "number_of_missing_values": "0"
      },
      {
        "data_type": "numeric",
        "index": "35",
        "is_ignore": "false",
        "is_row_identifier": "false",
        "is_target": "false",
        "name": "35",
        "number_of_missing_values": "0"
      },
      {
        "data_type": "numeric",
        "index": "36",
        "is_ignore": "false",
        "is_row_identifier": "false",
        "is_target": "false",
        "name": "36",
        "number_of_missing_values": "0"
      },
      {
        "data_type": "numeric",
        "index": "37",
        "is_ignore": "false",
        "is_row_identifier": "false",
        "is_target": "false",
        "name": "37",
        "number_of_missing_values": "0"
      },
      {
        "data_type": "numeric",
        "index": "38",
        "is_ignore": "false",
        "is_row_identifier": "false",
        "is_target": "false",
        "name": "38",
        "number_of_missing_values": "0"
      },
      {
        "data_type": "numeric",
        "index": "39",
        "is_ignore": "false",
        "is_row_identifier": "false",
        "is_target": "false",
        "name": "39",
        "number_of_missing_values": "0"
      },
      {
        "data_type": "numeric",
        "index": "40",
        "is_ignore": "false",
        "is_row_identifier": "false",
        "is_target": "false",
        "name": "40",
        "number_of_missing_values": "0"
      },
      {
        "data_type": "numeric",
        "index": "41",
        "is_ignore": "false",
        "is_row_identifier": "false",
        "is_target": "false",
        "name": "41",
        "number_of_missing_values": "0"
      },
      {
        "data_type": "numeric",
        "index": "42",
        "is_ignore": "false",
        "is_row_identifier": "false",
        "is_target": "false",
        "name": "42",
        "number_of_missing_values": "0"
      },
      {
        "data_type": "numeric",
        "index": "43",
        "is_ignore": "false",
        "is_row_identifier": "false",
        "is_target": "false",
        "name": "43",
        "number_of_missing_values": "0"
      },
      {
        "data_type": "numeric",
        "index": "44",
        "is_ignore": "false",
        "is_row_identifier": "false",
        "is_target": "false",
        "name": "44",
        "number_of_missing_values": "0"
      },
      {
        "data_type": "numeric",
        "index": "45",
        "is_ignore": "false",
        "is_row_identifier": "false",
        "is_target": "false",
        "name": "45",
        "number_of_missing_values": "0"
      },
      {
        "data_type": "numeric",
        "index": "46",
        "is_ignore": "false",
        "is_row_identifier": "false",
        "is_target": "false",
        "name": "46",
        "number_of_missing_values": "0"
      },
      {
        "data_type": "numeric",
        "index": "47",
        "is_ignore": "false",
        "is_row_identifier": "false",
        "is_target": "false",
        "name": "47",
        "number_of_missing_values": "0"
      },
      {
        "data_type": "numeric",
        "index": "48",
        "is_ignore": "false",
        "is_row_identifier": "false",
        "is_target": "false",
        "name": "48",
        "number_of_missing_values": "0"
      },
      {
        "data_type": "numeric",
        "index": "49",
        "is_ignore": "false",
        "is_row_identifier": "false",
        "is_target": "false",
        "name": "49",
        "number_of_missing_values": "0"
      },
      {
        "data_type": "numeric",
        "index": "50",
        "is_ignore": "false",
        "is_row_identifier": "false",
        "is_target": "false",
        "name": "50",
        "number_of_missing_values": "0"
      },
      {
        "data_type": "numeric",
        "index": "51",
        "is_ignore": "false",
        "is_row_identifier": "false",
        "is_target": "false",
        "name": "51",
        "number_of_missing_values": "0"
      },
      {
        "data_type": "numeric",
        "index": "52",
        "is_ignore": "false",
        "is_row_identifier": "false",
        "is_target": "false",
        "name": "52",
        "number_of_missing_values": "0"
      },
      {
        "data_type": "numeric",
        "index": "53",
        "is_ignore": "false",
        "is_row_identifier": "false",
        "is_target": "false",
        "name": "53",
        "number_of_missing_values": "0"
      },
      {
        "data_type": "numeric",
        "index": "54",
        "is_ignore": "false",
        "is_row_identifier": "false",
        "is_target": "false",
        "name": "54",
        "number_of_missing_values": "0"
      },
      {
        "data_type": "numeric",
        "index": "55",
        "is_ignore": "false",
        "is_row_identifier": "false",
        "is_target": "false",
        "name": "55",
        "number_of_missing_values": "0"
      },
      {
        "data_type": "numeric",
        "index": "56",
        "is_ignore": "false",
        "is_row_identifier": "false",
        "is_target": "false",
        "name": "56",
        "number_of_missing_values": "0"
      },
      {
        "data_type": "numeric",
        "index": "57",
        "is_ignore": "false",
        "is_row_identifier": "false",
        "is_target": "false",
        "name": "57",
        "number_of_missing_values": "0"
      },
      {
        "data_type": "numeric",
        "index": "58",
        "is_ignore": "false",
        "is_row_identifier": "false",
        "is_target": "false",
        "name": "58",
        "number_of_missing_values": "0"
      },
      {
        "data_type": "numeric",
        "index": "59",
        "is_ignore": "false",
        "is_row_identifier": "false",
        "is_target": "false",
        "name": "59",
        "number_of_missing_values": "0"
      },
      {
        "data_type": "numeric",
        "index": "60",
        "is_ignore": "false",
        "is_row_identifier": "false",
        "is_target": "false",
        "name": "60",
        "number_of_missing_values": "0"
      },
      {
        "data_type": "numeric",
        "index": "61",
        "is_ignore": "false",
        "is_row_identifier": "false",
        "is_target": "false",
        "name": "61",
        "number_of_missing_values": "0"
      }
    ]
  }
}