{
  "data_set_description": {
    "description": "Revalidation dataset with 20 instances",
    "description_version": "1",
    "file_id": "18632739",
    "format": "ARFF",
    "id": "41029",
    "licence": "Public",
    "md5_checksum": "267d9457b883a3dfb3d528a9be8cfae2",
    "minio_url": "https://data.openml.org/datasets/0004/41029/dataset_41029.pq",
    "name": "data-v3.en-es-lit.clean.anno.uniform.20top",
    "parquet_url": "https://data.openml.org/datasets/0004/41029/dataset_41029.pq",
    "processing_date": "2018-10-31 02:25:30",
    "status": "in_preparation",
    "tag": [
      "study_53",
      "user_3128"
    ],
    "upload_date": "2018-02-23T23:42:48",
    "url": "https://api.openml.org/data/v1/download/18632739/data-v3.en-es-lit.clean.anno.uniform.20top.arff",
    "version": "1",
    "visibility": "public"
  }
}