{
  "data_set_description": {
    "creator": [
      "J. N. van Rijn",
      "J. K. Vis"
    ],
    "default_target_attribute": "class",
    "description": "### Description ###\n\nThis dataset is part of a collection datasets based on the game \"Jungle Chess\" (a.k.a. Dou Shou Qi). For a description of the rules, please refer to the paper (link attached). The paper also contains a description of various constructed features. As the tablebases are a disjoint set of several tablebases based on which (two) pieces are on the board, we have uploaded all tablebases that have explicit different content:\n\n* Rat vs Rat\n* Rat vs Panther\n* Rat vs. Lion\n* Rat vs. Elephant\n* Panther vs. Lion\n* Panther vs. Elephant\n* Tiger vs. Lion\n* Lion vs. Lion\n* Lion vs. Elephant\n* Elephant vs. Elephant\n* Complete (Combination of the above)\n* RAW Complete (Combination of the above, containing for both pieces just the rank, file and strength information). This dataset contains a similar classification problem as, e.g., the King and Rook vs. King problem and is suitable for classification tasks. \n\n(Note that this dataset is one of the above mentioned datasets). Additionally, note that several subproblems are very similar. Having seen a given positions from one of the tablebases arguably gives a lot of information about the outcome of the same position in the other tablebases. \n\n### Please cite ###\nJ. N. van Rijn and J. K. Vis, Endgame Analysis of Dou Shou Qi. ICGA Journal 37:2, 120--124, 2014. ArXiv link: https://arxiv.org/abs/1604.07312",
    "description_version": "1",
    "file_id": "18248709",
    "format": "arff",
    "id": "41005",
    "licence": "Public",
    "md5_checksum": "526ba52a2214fdbfe174445aa8de3fde",
    "minio_url": "https://data.openml.org/datasets/0004/41005/dataset_41005.pq",
    "name": "jungle_chess_2pcs_endgame_rat_rat",
    "parquet_url": "https://data.openml.org/datasets/0004/41005/dataset_41005.pq",
    "processing_date": "2018-10-04 07:24:33",
    "status": "active",
    "tag": [
      "Artificial Intelligence",
      "derived",
      "DouShouQi",
      "Games",
      "JungleChess",
      "Retrogade"
    ],
    "upload_date": "2017-12-22T16:38:17",
    "url": "https://api.openml.org/data/v1/download/18248709/jungle_chess_2pcs_endgame_rat_rat.arff",
    "version": "1",
    "visibility": "public"
  }
}