{
  "data_features": {
    "feature": [
      {
        "data_type": "nominal",
        "index": "0",
        "is_ignore": "false",
        "is_row_identifier": "false",
        "is_target": "false",
        "name": "Name",
        "nominal_value": [
          "AAPTOS_AAPTOS",
          "ALECTONA_MILLARI",
          "CLIONA_CARTERI",
          "CLIONA_CELATA",
          "CLIONA_LABYRINTHICA",
          "CLIONA_SCHMIDTI",
          "CLIONA_VIRIDIS",
          "DIPLASTRELLA_BISTELLATA",
          "DIPLASTRELLA_ORNATA",
          "LAXOSUBERITES_ECTYONIMUS",
          "LAXOSUBERITES_FERRERHERNANDEZI",
          "LAXOSUBERITES_RUGOSUS",
          "OXYCORDYLA_PELLITA",
          "POLYMASTIA_AGGLUTINARIS",
          "POLYMASTIA_CONIGERA",
          "POLYMASTIA_CORTICATA",
          "POLYMASTIA_ECTOFIBROSA",
          "POLYMASTIA_FUSCA",
          "POLYMASTIA_GRIMALDI",
          "POLYMASTIA_HIRSUTA",
          "POLYMASTIA_INFLATA",
          "POLYMASTIA_INFRAPILOSA",
          "POLYMASTIA_INVAGINATA",
          "POLYMASTIA_LITTORALIS",
          "POLYMASTIA_MAMMILLARIS",
          "POLYMASTIA_MARTAE",
          "POLYMASTIA_POLYTYLOTA",
          "POLYMASTIA_RADIOSA",
          "POLYMASTIA_ROBUSTA",
          "POLYMASTIA_SPINULA",
          "POLYMASTIA_TENAX",
          "POLYMASTIA_TISSIERI",
          "POLYMASTIA_UBERRIMA",
          "PROSUBERITES_EPIPHYTUM",
          "PROSUBERITES_LONGISPINA",
          "PROSUBERITES_RUGOSUS",
          "PROTELEIA_SOLLASI",
          "PSEUDOSUBERITES_HYALINUS",
          "PSEUDOSUBERITES_SULFUREUS",
          "QUASILINA_BREVIS",
          "QUASILINA_INTERMEDIA",
          "QUASILINA_RICHARDII",
          "RHIZAXINELLA_BISETA",
          "RHIZAXINELLA_ELONGATA",
          "RHIZAXINELLA_PYRIFERA",
          "RHIZAXINELLA_UNISETA",
          "RIDLEYA_OVIFORMIS",
          "SPHAEROTYLUS_ANTARCTICUS",
          "SPHAEROTYLUS_CAPITATUS",
          "SPINULARIA_SPINULARIA",
          "SPIRASTRELLA_CUNCTATRIX",
          "SPIRASTRELLA_MINAX",
          "STYLOCORDYLA_BOREALIS",
          "SUBERITES_CAMINATUS",
          "SUBERITES_CARNOSUS_V.INCRUSTANS",
          "SUBERITES_CARNOSUS_V.RAMOSUS",
          "SUBERITES_CARNOSUS_V.TYPICUS",
          "SUBERITES_DOMUNCULA",
          "SUBERITES_FICUS",
          "SUBERITES_GIBBOSICEPS",
          "TENTORIUM_PAPILLATUS",
          "TENTORIUM_SEMISUBERITES",
          "TERPIOS_FUGAX",
          "TETHYA_AURANTIUM",
          "TETHYA_CITRINA",
          "TIMEA_CHONDRILLOIDES",
          "TIMEA_HALLEZI",
          "TIMEA_MIXTA",
          "TIMEA_STELLATA",
          "TIMEA_UNISTELLATA",
          "TRACHYTELEIA_STEPHENSI",
          "TRICHOSTEMA_HEMISPHAERICUM",
          "TRICHOSTEMA_SARSI",
          "TYLEXOCLADUS_JOUBINI",
          "WEBERELLA_BURSA",
          "WEBERELLA_VERRUCOSA"
        ],
        "number_of_missing_values": "0"
      },
      {
        "data_type": "nominal",
        "index": "1",
        "is_ignore": "false",
        "is_row_identifier": "false",
        "is_target": "false",
        "name": "A.CAPAS_DEL_CORTEX",
        "nominal_value": [
          "1_CAPA",
          "2_CAPAS",
          "3_CAPAS",
          "SIN_CORTEX"
        ],
        "number_of_missing_values": "0"
      },
      {
        "data_type": "nominal",
        "index": "2",
        "is_ignore": "false",
        "is_row_identifier": "false",
        "is_target": "false",
        "name": "A.CAPA_INTERNA_DEL_CORTEX",
        "nominal_value": [
          "BANDAS_DE_ESPICULAS_CRUZADAS",
          "MICROSCLERAS",
          "PERPENDICULAR",
          "SIN_CAPA_INTERNA_DEL_CORTEX",
          "TANGENCIAL",
          "TANGENCIAL_Y_PERPENDICULAR"
        ],
        "number_of_missing_values": "0"
      },
      {
        "data_type": "nominal",
        "index": "3",
        "is_ignore": "false",
        "is_row_identifier": "false",
        "is_target": "false",
        "name": "A.CORTEX",
        "nominal_value": [
          "NO",
          "SI"
        ],
        "number_of_missing_values": "0"
      },
      {
        "data_type": "nominal",
        "index": "4",
        "is_ignore": "false",
        "is_row_identifier": "false",
        "is_target": "false",
        "name": "A.CORTEX_FIBROSO",
        "nominal_value": [
          "NO",
          "SI",
          "SIN_CORTEX"
        ],
        "number_of_missing_values": "0"
      },
      {
        "data_type": "nominal",
        "index": "5",
        "is_ignore": "false",
        "is_row_identifier": "false",
        "is_target": "false",
        "name": "A.CORTEX_SOLO_DE_ESPICULAS_TANGENCIALES",
        "nominal_value": [
          "NO",
          "SI",
          "SIN_CORTEX"
        ],
        "number_of_missing_values": "0"
      },
      {
        "data_type": "nominal",
        "index": "6",
        "is_ignore": "false",
        "is_row_identifier": "false",
        "is_target": "false",
        "name": "A.CUERPOS_EXTRANOS_EN_EL_CORTEX",
        "nominal_value": [
          "NO",
          "SI",
          "SIN_CORTEX"
        ],
        "number_of_missing_values": "0"
      },
      {
        "data_type": "numeric",
        "index": "7",
        "is_ignore": "false",
        "is_row_identifier": "false",
        "is_target": "false",
        "name": "A.GROSOR_DEL_CORTEX",
        "number_of_missing_values": "0"
      },
      {
        "data_type": "nominal",
        "index": "8",
        "is_ignore": "false",
        "is_row_identifier": "false",
        "is_target": "false",
        "name": "A.HACES_DE_ESPICULAS_PRINCIPALES_EN_POMPON_EN_EL_CORTEX",
        "nominal_value": [
          "NO",
          "SI"
        ],
        "number_of_missing_values": "0"
      },
      {
        "data_type": "nominal",
        "index": "9",
        "is_ignore": "false",
        "is_row_identifier": "false",
        "is_target": "false",
        "name": "A.TILOSTILOS_ADICIONALES_COANOSOMA",
        "nominal_value": [
          "ECTOSOMICOS_DISPERSOS",
          "ECTOSOMICOS_EN_RAMILLETES",
          "INTERMEDIARIOS",
          "INTERMEDIARIOS_Y_ECTOSOMICOS",
          "SIN_TILOSTILOS_ADICIONALES"
        ],
        "number_of_missing_values": "0"
      },
      {
        "data_type": "nominal",
        "index": "10",
        "is_ignore": "false",
        "is_row_identifier": "false",
        "is_target": "false",
        "name": "B.NUMERO_DE_TIPOS_DE_MEGASCLERAS",
        "nominal_value": [
          "1_TIPO",
          "2_TIPOS",
          "3_TIPOS",
          "SI_TIPO"
        ],
        "number_of_missing_values": "0"
      },
      {
        "data_type": "nominal",
        "index": "11",
        "is_ignore": "false",
        "is_row_identifier": "false",
        "is_target": "false",
        "name": "C.TIPO_ESPICULA_PRINCIPAL_DIACTINA_TUBERCULADA",
        "nominal_value": [
          "NO",
          "SI"
        ],
        "number_of_missing_values": "0"
      },
      {
        "data_type": "nominal",
        "index": "12",
        "is_ignore": "false",
        "is_row_identifier": "false",
        "is_target": "false",
        "name": "C.TIPO_ESPICULA_PRINCIPAL_ESTILO",
        "nominal_value": [
          "NO",
          "SI"
        ],
        "number_of_missing_values": "0"
      },
      {
        "data_type": "nominal",
        "index": "13",
        "is_ignore": "false",
        "is_row_identifier": "false",
        "is_target": "false",
        "name": "C.TIPO_ESPICULA_PRINCIPAL_ESTILOS_2_TAMANOS",
        "nominal_value": [
          "NO",
          "SI"
        ],
        "number_of_missing_values": "0"
      },
      {
        "data_type": "nominal",
        "index": "14",
        "is_ignore": "false",
        "is_row_identifier": "false",
        "is_target": "false",
        "name": "C.TIPO_ESPICULA_PRINCIPAL_ESTILO_TILOSTILO",
        "nominal_value": [
          "NO",
          "SI"
        ],
        "number_of_missing_values": "0"
      },
      {
        "data_type": "nominal",
        "index": "15",
        "is_ignore": "false",
        "is_row_identifier": "false",
        "is_target": "false",
        "name": "C.TIPO_ESPICULA_PRINCIPAL_ESTRONGILOXA",
        "nominal_value": [
          "NO",
          "SI"
        ],
        "number_of_missing_values": "0"
      },
      {
        "data_type": "nominal",
        "index": "16",
        "is_ignore": "false",
        "is_row_identifier": "false",
        "is_target": "false",
        "name": "C.TIPO_ESPICULA_PRINCIPAL_OXAS",
        "nominal_value": [
          "NO",
          "SI"
        ],
        "number_of_missing_values": "0"
      },
      {
        "data_type": "nominal",
        "index": "17",
        "is_ignore": "false",
        "is_row_identifier": "false",
        "is_target": "false",
        "name": "C.TIPO_ESPICULA_PRINCIPAL_TILOSTILO",
        "nominal_value": [
          "NO",
          "SI"
        ],
        "number_of_missing_values": "0"
      },
      {
        "data_type": "nominal",
        "index": "18",
        "is_ignore": "false",
        "is_row_identifier": "false",
        "is_target": "false",
        "name": "D.ESPICULA_PRINCIPAL_ESTILO",
        "nominal_value": [
          "FUSIFORME",
          "NORMAL",
          "POLITILOTA",
          "SIN_ESPICULA_PRINCIPAL_ESTILO"
        ],
        "number_of_missing_values": "0"
      },
      {
        "data_type": "nominal",
        "index": "19",
        "is_ignore": "false",
        "is_row_identifier": "false",
        "is_target": "false",
        "name": "D.ESPICULA_PRINCIPAL_TILOSTILO",
        "nominal_value": [
          "FUSIFORME",
          "NORMAL",
          "POLITILOTA",
          "SIN_ESPICULA_PRINCIPAL_TILOSTILO_"
        ],
        "number_of_missing_values": "0"
      },
      {
        "data_type": "nominal",
        "index": "20",
        "is_ignore": "false",
        "is_row_identifier": "false",
        "is_target": "false",
        "name": "D.FORMA_BASE_TILOSTILO_PRINCIPAL",
        "nominal_value": [
          "POMO",
          "SIN_TILOSTILOS",
          "SUBESFERICA_ALARGADA_OVOIDE",
          "TRILOBULADA"
        ],
        "number_of_missing_values": "0"
      },
      {
        "data_type": "nominal",
        "index": "21",
        "is_ignore": "false",
        "is_row_identifier": "false",
        "is_target": "false",
        "name": "E.DISPOSICION_MEGASCLERAS_ECTOSOMICAS_EN_EL_ECTOSOMA",
        "nominal_value": [
          "EMPALIZADA",
          "RAMILLETES",
          "SIN_MEGASCLERAS_ECTOSOMICAS",
          "TANGENCIALES"
        ],
        "number_of_missing_values": "0"
      },
      {
        "data_type": "nominal",
        "index": "22",
        "is_ignore": "false",
        "is_row_identifier": "false",
        "is_target": "false",
        "name": "E.FORMA_BASE_TILOSTILO_ECTOSOMICO",
        "nominal_value": [
          "SIN_TILOSTILO_ECTOSOMICO",
          "SUBESFERICA_ALARGADA_OVOIDE",
          "TRILOBULADA_CON_VESICULA_AXIAL"
        ],
        "number_of_missing_values": "0"
      },
      {
        "data_type": "nominal",
        "index": "23",
        "is_ignore": "false",
        "is_row_identifier": "false",
        "is_target": "false",
        "name": "E.FORMA_MEGASCLERA_ECTOSOMICA",
        "nominal_value": [
          "CURVADA",
          "RECTA_FUSIFORME",
          "RECTA_NO_FUSIFORME",
          "SIN_MEGASCLERA_ECTOSOMICA"
        ],
        "number_of_missing_values": "0"
      },
      {
        "data_type": "nominal",
        "index": "24",
        "is_ignore": "false",
        "is_row_identifier": "false",
        "is_target": "false",
        "name": "E.TIPO_MEGASCLERA_ECTOSOMICA",
        "nominal_value": [
          "ESTILO",
          "ESTILO_TILOSTILO",
          "OXAS_ESTRONGILOXAS",
          "SIN_MEGASCLERA_ECTOSOMICA",
          "TILOSTILO"
        ],
        "number_of_missing_values": "0"
      },
      {
        "data_type": "nominal",
        "index": "25",
        "is_ignore": "false",
        "is_row_identifier": "false",
        "is_target": "false",
        "name": "F.TIPO_DE_EXOSTILO",
        "nominal_value": [
          "ANATRIENAS",
          "CLADOTILOSTILOS",
          "ESFEROTILOS",
          "SIN_EXOSTILOS",
          "TILOSTILOS_ESPINOSOS_EN_LA_PUNTA",
          "TILOSTILO_LISO"
        ],
        "number_of_missing_values": "0"
      },
      {
        "data_type": "nominal",
        "index": "26",
        "is_ignore": "false",
        "is_row_identifier": "false",
        "is_target": "false",
        "name": "G.FORMA_MEGASCLERA_INTERMEDIARIA",
        "nominal_value": [
          "FUSIFORME",
          "NORMAL",
          "POLITILOTA",
          "SIN_MEGASCLERA_INTERMEDIARIA"
        ],
        "number_of_missing_values": "0"
      },
      {
        "data_type": "nominal",
        "index": "27",
        "is_ignore": "false",
        "is_row_identifier": "false",
        "is_target": "false",
        "name": "G.TIPO_MEGASCLERA_INTERMEDIARIA",
        "nominal_value": [
          "ESTILO",
          "ESTILO_TILOSTILO",
          "SIN_MEGASCLERA_INTERMEDIARIA",
          "TILOSTILO"
        ],
        "number_of_missing_values": "0"
      },
      {
        "data_type": "numeric",
        "index": "28",
        "is_ignore": "false",
        "is_row_identifier": "false",
        "is_target": "false",
        "name": "H.LONGITUD_MEGASCLERAS",
        "number_of_missing_values": "0"
      },
      {
        "data_type": "nominal",
        "index": "29",
        "is_ignore": "false",
        "is_row_identifier": "false",
        "is_target": "false",
        "name": "I.MICROSCLERAS",
        "nominal_value": [
          "NO",
          "SI"
        ],
        "number_of_missing_values": "0"
      },
      {
        "data_type": "nominal",
        "index": "30",
        "is_ignore": "false",
        "is_row_identifier": "false",
        "is_target": "false",
        "name": "I.TIPO_MICROSCLERA",
        "nominal_value": [
          "ASTER",
          "MICROESTILOS_Y_MICROXAS",
          "MICROESTRONGILOS_CENTROTILOTES",
          "SIN_MICROSCLERAS",
          "TRICODRAGMA"
        ],
        "number_of_missing_values": "0"
      },
      {
        "data_type": "nominal",
        "index": "31",
        "is_ignore": "false",
        "is_row_identifier": "false",
        "is_target": "false",
        "name": "J.ASTER",
        "nominal_value": [
          "NO",
          "SI"
        ],
        "number_of_missing_values": "0"
      },
      {
        "data_type": "nominal",
        "index": "32",
        "is_ignore": "false",
        "is_row_identifier": "false",
        "is_target": "false",
        "name": "J.DIAMETRO_ESFERASTER",
        "nominal_value": [
          "SIN_ESFERASTER",
          "|10_12|",
          "|20_25|",
          "|27_44|",
          "|40_110|",
          "|5_6_Y_15_35|"
        ],
        "number_of_missing_values": "0"
      },
      {
        "data_type": "nominal",
        "index": "33",
        "is_ignore": "false",
        "is_row_identifier": "false",
        "is_target": "false",
        "name": "J.TIPO_DE_ASTER",
        "nominal_value": [
          "ANFIASTER",
          "DIPLASTER",
          "ESFERASTER",
          "ESPIRASTER",
          "QUIASTER",
          "QUIASTER_Y_ESFERASTER",
          "SIN_ASTER"
        ],
        "number_of_missing_values": "0"
      },
      {
        "data_type": "nominal",
        "index": "34",
        "is_ignore": "false",
        "is_row_identifier": "false",
        "is_target": "false",
        "name": "J.TIPO_DE_DIPLASTER",
        "nominal_value": [
          "CON_ACTINAS_COMPLEJAS",
          "CON_ACTINAS_SIMPLES",
          "SIN_DIPLASTERES"
        ],
        "number_of_missing_values": "0"
      },
      {
        "data_type": "nominal",
        "index": "35",
        "is_ignore": "false",
        "is_row_identifier": "false",
        "is_target": "false",
        "name": "J.TIPO_DE_ESFERASTER",
        "nominal_value": [
          "OXIESFERASTER",
          "OXIESFERASTER_Y_TILOESFERASTER",
          "SIN_ESFERASTER"
        ],
        "number_of_missing_values": "0"
      },
      {
        "data_type": "nominal",
        "index": "36",
        "is_ignore": "false",
        "is_row_identifier": "false",
        "is_target": "false",
        "name": "K.FORMA_FINAL",
        "nominal_value": [
          "DE_CONO_INVERTIDO",
          "DE_REVESTIMIENTO",
          "GLOBULOSA",
          "HEMISFERICA",
          "INCRUSTANTE",
          "MASIVO_IRREGULAR",
          "MAZAS_PEDUNCULADAS_1/PEDUNCULO",
          "MAZAS_PEDUNCULADAS_VARIAS/PEDUNCULO",
          "RAMIFICADA"
        ],
        "number_of_missing_values": "0"
      },
      {
        "data_type": "numeric",
        "index": "37",
        "is_ignore": "false",
        "is_row_identifier": "false",
        "is_target": "false",
        "name": "L.NUMERO_DE_PAPILAS",
        "number_of_missing_values": "0"
      },
      {
        "data_type": "nominal",
        "index": "38",
        "is_ignore": "false",
        "is_row_identifier": "false",
        "is_target": "false",
        "name": "L.PAPILAS",
        "nominal_value": [
          "NO",
          "SI"
        ],
        "number_of_missing_values": "0"
      },
      {
        "data_type": "nominal",
        "index": "39",
        "is_ignore": "false",
        "is_row_identifier": "false",
        "is_target": "false",
        "name": "M.COLOR",
        "nominal_value": [
          "AMARILLO_PALIDO",
          "AZUL_O_ANARANJADO_INTENSOS",
          "OTROS"
        ],
        "number_of_missing_values": "22"
      },
      {
        "data_type": "nominal",
        "index": "40",
        "is_ignore": "false",
        "is_row_identifier": "false",
        "is_target": "false",
        "name": "N.SUPERFICIE",
        "nominal_value": [
          "ATERCIOPELADA",
          "CON_AREAS_POLIGONALES_ABULTADAS",
          "FRANJA_BASAL_DE_ESPICULAS_EN_FLECO",
          "HISPIDEZ_MAYOR_HACIA_LA_BASE",
          "LISA",
          "RUGOSA",
          "SOLO_PAPILAS_LISAS",
          "TOTALMENTE_HISPIDA"
        ],
        "number_of_missing_values": "0"
      },
      {
        "data_type": "nominal",
        "index": "41",
        "is_ignore": "false",
        "is_row_identifier": "false",
        "is_target": "false",
        "name": "O.DISPOSICION_ESPICULAR_ESQUELETO",
        "nominal_value": [
          "AXIAL",
          "CONFUSA",
          "HYMEDESMOIDE",
          "PLUMOSA",
          "RADIAL",
          "RADIAL_EN_PERIFERIA",
          "REDUCIDO"
        ],
        "number_of_missing_values": "0"
      },
      {
        "data_type": "nominal",
        "index": "42",
        "is_ignore": "false",
        "is_row_identifier": "false",
        "is_target": "false",
        "name": "P.ALOJA_CANGREJO_ERMITANO",
        "nominal_value": [
          "NO",
          "SI"
        ],
        "number_of_missing_values": "0"
      },
      {
        "data_type": "nominal",
        "index": "43",
        "is_ignore": "false",
        "is_row_identifier": "false",
        "is_target": "false",
        "name": "P.PERFORANTE",
        "nominal_value": [
          "NO",
          "SI"
        ],
        "number_of_missing_values": "0"
      },
      {
        "data_type": "nominal",
        "index": "44",
        "is_ignore": "false",
        "is_row_identifier": "false",
        "is_target": "false",
        "name": "P.PSEUDORAICES",
        "nominal_value": [
          "NO",
          "SI"
        ],
        "number_of_missing_values": "0"
      },
      {
        "data_type": "nominal",
        "index": "45",
        "is_ignore": "false",
        "is_row_identifier": "false",
        "is_target": "false",
        "name": "P.SUSTRATO",
        "nominal_value": [
          "AMBOS",
          "BLANDO",
          "DURO"
        ],
        "number_of_missing_values": "0"
      }
    ]
  }
}