{
  "data_set_description": {
    "description": "test",
    "description_version": "1",
    "file_id": "17218952",
    "format": "ARFF",
    "id": "40955",
    "licence": "Public",
    "md5_checksum": "ad484452702105cbf3d30f8deaba39a9",
    "minio_url": "https://data.openml.org/datasets/0004/40955/dataset_40955.pq",
    "name": "UploadTestWithURL",
    "parquet_url": "https://data.openml.org/datasets/0004/40955/dataset_40955.pq",
    "processing_date": "2018-10-30 00:41:30",
    "status": "in_preparation",
    "upload_date": "2017-10-18T16:35:49",
    "url": "https://api.openml.org/data/v1/download/17218952/UploadTestWithURL.arff",
    "version": "4",
    "visibility": "public"
  }
}