{
  "data_qualities": {
    "quality": [
      {
        "name": "AutoCorrelation",
        "value": "0.9995108642485244"
      },
      {
        "name": "ClassEntropy",
        "value": "5.5235619560570095"
      },
      {
        "name": "Dimensionality",
        "value": "0.011141304347826087"
      },
      {
        "name": "EquivalentNumberOfAtts",
        "value": []
      },
      {
        "name": "MajorityClassPercentage",
        "value": "2.1739130434782608"
      },
      {
        "name": "MajorityClassSize",
        "value": "2000.0"
      },
      {
        "name": "MaxAttributeEntropy",
        "value": []
      },
      {
        "name": "MaxKurtosisOfNumericAtts",
        "value": "27.70170878634333"
      },
      {
        "name": "MaxMeansOfNumericAtts",
        "value": "163.71332608695656"
      },
      {
        "name": "MaxMutualInformation",
        "value": []
      },
      {
        "name": "MaxNominalAttDistinctValues",
        "value": "46.0"
      },
      {
        "name": "MaxSkewnessOfNumericAtts",
        "value": "5.207717655045808"
      },
      {
        "name": "MaxStdDevOfNumericAtts",
        "value": "115.16200053583661"
      },
      {
        "name": "MeanAttributeEntropy",
        "value": []
      },
      {
        "name": "MeanKurtosisOfNumericAtts",
        "value": "-0.27132459428504024"
      },
      {
        "name": "MeanMeansOfNumericAtts",
        "value": "61.250598675271796"
      },
      {
        "name": "MeanMutualInformation",
        "value": []
      },
      {
        "name": "MeanNoiseToSignalRatio",
        "value": []
      },
      {
        "name": "MeanNominalAttDistinctValues",
        "value": "46.0"
      },
      {
        "name": "MeanSkewnessOfNumericAtts",
        "value": "0.9291540443087587"
      },
      {
        "name": "MeanStdDevOfNumericAtts",
        "value": "77.05396737055445"
      },
      {
        "name": "MinAttributeEntropy",
        "value": []
      },
      {
        "name": "MinKurtosisOfNumericAtts",
        "value": "-1.8397895545847154"
      },
      {
        "name": "MinMeansOfNumericAtts",
        "value": "0.0"
      },
      {
        "name": "MinMutualInformation",
        "value": []
      },
      {
        "name": "MinNominalAttDistinctValues",
        "value": "46.0"
      },
      {
        "name": "MinSkewnessOfNumericAtts",
        "value": "-0.6101155606053595"
      },
      {
        "name": "MinStdDevOfNumericAtts",
        "value": "0.0"
      },
      {
        "name": "MinorityClassPercentage",
        "value": "2.1739130434782608"
      },
      {
        "name": "MinorityClassSize",
        "value": "2000.0"
      },
      {
        "name": "NumberOfBinaryFeatures",
        "value": "0.0"
      },
      {
        "name": "NumberOfClasses",
        "value": "46.0"
      },
      {
        "name": "NumberOfFeatures",
        "value": "1025.0"
      },
      {
        "name": "NumberOfInstances",
        "value": "92000.0"
      },
      {
        "name": "NumberOfInstancesWithMissingValues",
        "value": "0.0"
      },
      {
        "name": "NumberOfMissingValues",
        "value": "0.0"
      },
      {
        "name": "NumberOfNumericFeatures",
        "value": "1024.0"
      },
      {
        "name": "NumberOfSymbolicFeatures",
        "value": "1.0"
      },
      {
        "name": "PercentageOfBinaryFeatures",
        "value": "0.0"
      },
      {
        "name": "PercentageOfInstancesWithMissingValues",
        "value": "0.0"
      },
      {
        "name": "PercentageOfMissingValues",
        "value": "0.0"
      },
      {
        "name": "PercentageOfNumericFeatures",
        "value": "99.90243902439025"
      },
      {
        "name": "PercentageOfSymbolicFeatures",
        "value": "0.0975609756097561"
      },
      {
        "name": "Quartile1AttributeEntropy",
        "value": []
      },
      {
        "name": "Quartile1KurtosisOfNumericAtts",
        "value": "-1.5597479227826985"
      },
      {
        "name": "Quartile1MeansOfNumericAtts",
        "value": "19.584763586956026"
      },
      {
        "name": "Quartile1MutualInformation",
        "value": []
      },
      {
        "name": "Quartile1SkewnessOfNumericAtts",
        "value": "0.4909297274034581"
      },
      {
        "name": "Quartile1StdDevOfNumericAtts",
        "value": "59.85722469443323"
      },
      {
        "name": "Quartile2AttributeEntropy",
        "value": []
      },
      {
        "name": "Quartile2KurtosisOfNumericAtts",
        "value": "-1.2954857062863232"
      },
      {
        "name": "Quartile2MeansOfNumericAtts",
        "value": "75.25985869565255"
      },
      {
        "name": "Quartile2MutualInformation",
        "value": []
      },
      {
        "name": "Quartile2SkewnessOfNumericAtts",
        "value": "0.709154340652421"
      },
      {
        "name": "Quartile2StdDevOfNumericAtts",
        "value": "103.57123575165997"
      },
      {
        "name": "Quartile3AttributeEntropy",
        "value": []
      },
      {
        "name": "Quartile3KurtosisOfNumericAtts",
        "value": "-0.3580469428409333"
      },
      {
        "name": "Quartile3MeansOfNumericAtts",
        "value": "92.53509510869814"
      },
      {
        "name": "Quartile3MutualInformation",
        "value": []
      },
      {
        "name": "Quartile3SkewnessOfNumericAtts",
        "value": "1.1977973128960633"
      },
      {
        "name": "Quartile3StdDevOfNumericAtts",
        "value": "108.33302415592964"
      },
      {
        "name": "StdvNominalAttDistinctValues",
        "value": "0.0"
      }
    ]
  }
}