{
  "data_qualities": {
    "quality": [
      {
        "name": "AutoCorrelation",
        "value": "0.9996665555185061"
      },
      {
        "name": "ClassEntropy",
        "value": "0.0958923454810596"
      },
      {
        "name": "Dimensionality",
        "value": "0.001"
      },
      {
        "name": "EquivalentNumberOfAtts",
        "value": []
      },
      {
        "name": "MajorityClassPercentage",
        "value": "98.76666666666667"
      },
      {
        "name": "MajorityClassSize",
        "value": "2963.0"
      },
      {
        "name": "MaxAttributeEntropy",
        "value": []
      },
      {
        "name": "MaxKurtosisOfNumericAtts",
        "value": "-1.2923224643788238"
      },
      {
        "name": "MaxMeansOfNumericAtts",
        "value": "1.566687316406018"
      },
      {
        "name": "MaxMutualInformation",
        "value": []
      },
      {
        "name": "MaxNominalAttDistinctValues",
        "value": "2.0"
      },
      {
        "name": "MaxSkewnessOfNumericAtts",
        "value": "-0.23881598558512412"
      },
      {
        "name": "MaxStdDevOfNumericAtts",
        "value": "5.21570510840907"
      },
      {
        "name": "MeanAttributeEntropy",
        "value": []
      },
      {
        "name": "MeanKurtosisOfNumericAtts",
        "value": "-1.4062878632891864"
      },
      {
        "name": "MeanMeansOfNumericAtts",
        "value": "0.4041834047972062"
      },
      {
        "name": "MeanMutualInformation",
        "value": []
      },
      {
        "name": "MeanNoiseToSignalRatio",
        "value": []
      },
      {
        "name": "MeanNominalAttDistinctValues",
        "value": "2.0"
      },
      {
        "name": "MeanSkewnessOfNumericAtts",
        "value": "-0.35292992658239675"
      },
      {
        "name": "MeanStdDevOfNumericAtts",
        "value": "5.05940891434563"
      },
      {
        "name": "MinAttributeEntropy",
        "value": []
      },
      {
        "name": "MinKurtosisOfNumericAtts",
        "value": "-1.520253262199549"
      },
      {
        "name": "MinMeansOfNumericAtts",
        "value": "-0.7583205068116056"
      },
      {
        "name": "MinMutualInformation",
        "value": []
      },
      {
        "name": "MinNominalAttDistinctValues",
        "value": "2.0"
      },
      {
        "name": "MinSkewnessOfNumericAtts",
        "value": "-0.4670438675796693"
      },
      {
        "name": "MinStdDevOfNumericAtts",
        "value": "4.9031127202821905"
      },
      {
        "name": "MinorityClassPercentage",
        "value": "1.2333333333333334"
      },
      {
        "name": "MinorityClassSize",
        "value": "37.0"
      },
      {
        "name": "NumberOfBinaryFeatures",
        "value": "1.0"
      },
      {
        "name": "NumberOfClasses",
        "value": "2.0"
      },
      {
        "name": "NumberOfFeatures",
        "value": "3.0"
      },
      {
        "name": "NumberOfInstances",
        "value": "3000.0"
      },
      {
        "name": "NumberOfInstancesWithMissingValues",
        "value": "0.0"
      },
      {
        "name": "NumberOfMissingValues",
        "value": "0.0"
      },
      {
        "name": "NumberOfNumericFeatures",
        "value": "2.0"
      },
      {
        "name": "NumberOfSymbolicFeatures",
        "value": "1.0"
      },
      {
        "name": "PercentageOfBinaryFeatures",
        "value": "33.33333333333333"
      },
      {
        "name": "PercentageOfInstancesWithMissingValues",
        "value": "0.0"
      },
      {
        "name": "PercentageOfMissingValues",
        "value": "0.0"
      },
      {
        "name": "PercentageOfNumericFeatures",
        "value": "66.66666666666666"
      },
      {
        "name": "PercentageOfSymbolicFeatures",
        "value": "33.33333333333333"
      },
      {
        "name": "Quartile1AttributeEntropy",
        "value": []
      },
      {
        "name": "Quartile1KurtosisOfNumericAtts",
        "value": "-1.520253262199549"
      },
      {
        "name": "Quartile1MeansOfNumericAtts",
        "value": "-0.7583205068116056"
      },
      {
        "name": "Quartile1MutualInformation",
        "value": []
      },
      {
        "name": "Quartile1SkewnessOfNumericAtts",
        "value": "-0.4670438675796693"
      },
      {
        "name": "Quartile1StdDevOfNumericAtts",
        "value": "4.9031127202821905"
      },
      {
        "name": "Quartile2AttributeEntropy",
        "value": []
      },
      {
        "name": "Quartile2KurtosisOfNumericAtts",
        "value": "-1.4062878632891864"
      },
      {
        "name": "Quartile2MeansOfNumericAtts",
        "value": "0.40418340479720627"
      },
      {
        "name": "Quartile2MutualInformation",
        "value": []
      },
      {
        "name": "Quartile2SkewnessOfNumericAtts",
        "value": "-0.35292992658239675"
      },
      {
        "name": "Quartile2StdDevOfNumericAtts",
        "value": "5.05940891434563"
      },
      {
        "name": "Quartile3AttributeEntropy",
        "value": []
      },
      {
        "name": "Quartile3KurtosisOfNumericAtts",
        "value": "-1.2923224643788238"
      },
      {
        "name": "Quartile3MeansOfNumericAtts",
        "value": "1.566687316406018"
      },
      {
        "name": "Quartile3MutualInformation",
        "value": []
      },
      {
        "name": "Quartile3SkewnessOfNumericAtts",
        "value": "-0.23881598558512412"
      },
      {
        "name": "Quartile3StdDevOfNumericAtts",
        "value": "5.21570510840907"
      },
      {
        "name": "StdvNominalAttDistinctValues",
        "value": "0.0"
      }
    ]
  }
}