{
  "data_qualities": {
    "quality": [
      {
        "name": "AutoCorrelation",
        "value": "0.8647034310320878"
      },
      {
        "name": "ClassEntropy",
        "value": "0.3812838896631388"
      },
      {
        "name": "Dimensionality",
        "value": "9.722222222222222E-4"
      },
      {
        "name": "EquivalentNumberOfAtts",
        "value": []
      },
      {
        "name": "MajorityClassPercentage",
        "value": "92.58333333333333"
      },
      {
        "name": "MajorityClassSize",
        "value": "6666.0"
      },
      {
        "name": "MaxAttributeEntropy",
        "value": []
      },
      {
        "name": "MaxKurtosisOfNumericAtts",
        "value": "261.9477142845789"
      },
      {
        "name": "MaxMeansOfNumericAtts",
        "value": "0.5205181527777778"
      },
      {
        "name": "MaxMutualInformation",
        "value": []
      },
      {
        "name": "MaxNominalAttDistinctValues",
        "value": "2.0"
      },
      {
        "name": "MaxSkewnessOfNumericAtts",
        "value": "14.525564126070142"
      },
      {
        "name": "MaxStdDevOfNumericAtts",
        "value": "0.18926936479888193"
      },
      {
        "name": "MeanAttributeEntropy",
        "value": []
      },
      {
        "name": "MeanKurtosisOfNumericAtts",
        "value": "57.60720460202939"
      },
      {
        "name": "MeanMeansOfNumericAtts",
        "value": "0.14430651111111112"
      },
      {
        "name": "MeanMutualInformation",
        "value": []
      },
      {
        "name": "MeanNoiseToSignalRatio",
        "value": []
      },
      {
        "name": "MeanNominalAttDistinctValues",
        "value": "2.0"
      },
      {
        "name": "MeanSkewnessOfNumericAtts",
        "value": "3.8249341750077632"
      },
      {
        "name": "MeanStdDevOfNumericAtts",
        "value": "0.051823080031399696"
      },
      {
        "name": "MinAttributeEntropy",
        "value": []
      },
      {
        "name": "MinKurtosisOfNumericAtts",
        "value": "-0.8762368326035763"
      },
      {
        "name": "MinMeansOfNumericAtts",
        "value": "0.004861402777777778"
      },
      {
        "name": "MinMutualInformation",
        "value": []
      },
      {
        "name": "MinNominalAttDistinctValues",
        "value": "2.0"
      },
      {
        "name": "MinSkewnessOfNumericAtts",
        "value": "-0.212572347692324"
      },
      {
        "name": "MinStdDevOfNumericAtts",
        "value": "0.007539165112330409"
      },
      {
        "name": "MinorityClassPercentage",
        "value": "7.416666666666667"
      },
      {
        "name": "MinorityClassSize",
        "value": "534.0"
      },
      {
        "name": "NumberOfBinaryFeatures",
        "value": "1.0"
      },
      {
        "name": "NumberOfClasses",
        "value": "2.0"
      },
      {
        "name": "NumberOfFeatures",
        "value": "7.0"
      },
      {
        "name": "NumberOfInstances",
        "value": "7200.0"
      },
      {
        "name": "NumberOfInstancesWithMissingValues",
        "value": "0.0"
      },
      {
        "name": "NumberOfMissingValues",
        "value": "0.0"
      },
      {
        "name": "NumberOfNumericFeatures",
        "value": "6.0"
      },
      {
        "name": "NumberOfSymbolicFeatures",
        "value": "1.0"
      },
      {
        "name": "PercentageOfBinaryFeatures",
        "value": "14.285714285714285"
      },
      {
        "name": "PercentageOfInstancesWithMissingValues",
        "value": "0.0"
      },
      {
        "name": "PercentageOfMissingValues",
        "value": "0.0"
      },
      {
        "name": "PercentageOfNumericFeatures",
        "value": "85.71428571428571"
      },
      {
        "name": "PercentageOfSymbolicFeatures",
        "value": "14.285714285714285"
      },
      {
        "name": "Quartile1AttributeEntropy",
        "value": []
      },
      {
        "name": "Quartile1KurtosisOfNumericAtts",
        "value": "3.452503856371688"
      },
      {
        "name": "Quartile1MeansOfNumericAtts",
        "value": "0.016197934027777774"
      },
      {
        "name": "Quartile1MutualInformation",
        "value": []
      },
      {
        "name": "Quartile1SkewnessOfNumericAtts",
        "value": "0.8828162658637742"
      },
      {
        "name": "Quartile1StdDevOfNumericAtts",
        "value": "0.016198186631971565"
      },
      {
        "name": "Quartile2AttributeEntropy",
        "value": []
      },
      {
        "name": "Quartile2KurtosisOfNumericAtts",
        "value": "16.90781943712377"
      },
      {
        "name": "Quartile2MeansOfNumericAtts",
        "value": "0.10363402430555557"
      },
      {
        "name": "Quartile2MutualInformation",
        "value": []
      },
      {
        "name": "Quartile2SkewnessOfNumericAtts",
        "value": "1.9504937087205372"
      },
      {
        "name": "Quartile2StdDevOfNumericAtts",
        "value": "0.0294739246949774"
      },
      {
        "name": "Quartile3AttributeEntropy",
        "value": []
      },
      {
        "name": "Quartile3KurtosisOfNumericAtts",
        "value": "99.88244897108726"
      },
      {
        "name": "Quartile3MeansOfNumericAtts",
        "value": "0.21504055173611114"
      },
      {
        "name": "Quartile3MutualInformation",
        "value": []
      },
      {
        "name": "Quartile3SkewnessOfNumericAtts",
        "value": "6.247151069401445"
      },
      {
        "name": "Quartile3StdDevOfNumericAtts",
        "value": "0.07439052151125479"
      },
      {
        "name": "StdvNominalAttDistinctValues",
        "value": "0.0"
      }
    ]
  }
}