{
  "data_qualities": {
    "quality": [
      {
        "name": "AutoCorrelation",
        "value": "0.6064659977703456"
      },
      {
        "name": "ClassEntropy",
        "value": "1.189833856204398"
      },
      {
        "name": "Dimensionality",
        "value": "0.043429844097995544"
      },
      {
        "name": "EquivalentNumberOfAtts",
        "value": "26.839183802676523"
      },
      {
        "name": "MajorityClassPercentage",
        "value": "76.16926503340757"
      },
      {
        "name": "MajorityClassSize",
        "value": "684.0"
      },
      {
        "name": "MaxAttributeEntropy",
        "value": "1.8215224482924186"
      },
      {
        "name": "MaxKurtosisOfNumericAtts",
        "value": "13.215477213878724"
      },
      {
        "name": "MaxMeansOfNumericAtts",
        "value": "1263.0946547884187"
      },
      {
        "name": "MaxMutualInformation",
        "value": "0.40908953764451"
      },
      {
        "name": "MaxNominalAttDistinctValues",
        "value": "7.0"
      },
      {
        "name": "MaxSkewnessOfNumericAtts",
        "value": "3.7616019689156888"
      },
      {
        "name": "MaxStdDevOfNumericAtts",
        "value": "1871.3991072665933"
      },
      {
        "name": "MeanAttributeEntropy",
        "value": "0.2515351603742048"
      },
      {
        "name": "MeanKurtosisOfNumericAtts",
        "value": "4.6480244352098286"
      },
      {
        "name": "MeanMeansOfNumericAtts",
        "value": "348.50426818856715"
      },
      {
        "name": "MeanMutualInformation",
        "value": "0.044331968697414056"
      },
      {
        "name": "MeanNoiseToSignalRatio",
        "value": "4.673900071775454"
      },
      {
        "name": "MeanNominalAttDistinctValues",
        "value": "1.6363636363636362"
      },
      {
        "name": "MeanSkewnessOfNumericAtts",
        "value": "2.0269825910719437"
      },
      {
        "name": "MeanStdDevOfNumericAtts",
        "value": "405.17326983791025"
      },
      {
        "name": "MinAttributeEntropy",
        "value": "-0.0"
      },
      {
        "name": "MinKurtosisOfNumericAtts",
        "value": "-0.9723842038435437"
      },
      {
        "name": "MinMeansOfNumericAtts",
        "value": "1.1985489977728285"
      },
      {
        "name": "MinMutualInformation",
        "value": "0.0"
      },
      {
        "name": "MinNominalAttDistinctValues",
        "value": "0.0"
      },
      {
        "name": "MinSkewnessOfNumericAtts",
        "value": "0.07299048442083138"
      },
      {
        "name": "MinStdDevOfNumericAtts",
        "value": "0.871208280971892"
      },
      {
        "name": "MinorityClassPercentage",
        "value": "0.8908685968819599"
      },
      {
        "name": "MinorityClassSize",
        "value": "8.0"
      },
      {
        "name": "NumberOfBinaryFeatures",
        "value": "4.0"
      },
      {
        "name": "NumberOfClasses",
        "value": "5.0"
      },
      {
        "name": "NumberOfFeatures",
        "value": "39.0"
      },
      {
        "name": "NumberOfInstances",
        "value": "898.0"
      },
      {
        "name": "NumberOfInstancesWithMissingValues",
        "value": "898.0"
      },
      {
        "name": "NumberOfMissingValues",
        "value": "22175.0"
      },
      {
        "name": "NumberOfNumericFeatures",
        "value": "6.0"
      },
      {
        "name": "NumberOfSymbolicFeatures",
        "value": "33.0"
      },
      {
        "name": "PercentageOfBinaryFeatures",
        "value": "10.256410256410255"
      },
      {
        "name": "PercentageOfInstancesWithMissingValues",
        "value": "100.0"
      },
      {
        "name": "PercentageOfMissingValues",
        "value": "63.317343384158534"
      },
      {
        "name": "PercentageOfNumericFeatures",
        "value": "15.384615384615385"
      },
      {
        "name": "PercentageOfSymbolicFeatures",
        "value": "84.61538461538461"
      },
      {
        "name": "Quartile1AttributeEntropy",
        "value": "0.0"
      },
      {
        "name": "Quartile1KurtosisOfNumericAtts",
        "value": "-0.40305022089010156"
      },
      {
        "name": "Quartile1MeansOfNumericAtts",
        "value": "3.025695155902005"
      },
      {
        "name": "Quartile1MutualInformation",
        "value": "0.0"
      },
      {
        "name": "Quartile1SkewnessOfNumericAtts",
        "value": "0.967384603629726"
      },
      {
        "name": "Quartile1StdDevOfNumericAtts",
        "value": "10.505435772171138"
      },
      {
        "name": "Quartile2AttributeEntropy",
        "value": "0.0"
      },
      {
        "name": "Quartile2KurtosisOfNumericAtts",
        "value": "1.6372437439142264"
      },
      {
        "name": "Quartile2MeansOfNumericAtts",
        "value": "21.222160356347437"
      },
      {
        "name": "Quartile2MutualInformation",
        "value": "0.0"
      },
      {
        "name": "Quartile2SkewnessOfNumericAtts",
        "value": "1.6547313364025702"
      },
      {
        "name": "Quartile2StdDevOfNumericAtts",
        "value": "69.85338529046133"
      },
      {
        "name": "Quartile3AttributeEntropy",
        "value": "0.2385631077559124"
      },
      {
        "name": "Quartile3KurtosisOfNumericAtts",
        "value": "12.741748058445403"
      },
      {
        "name": "Quartile3MeansOfNumericAtts",
        "value": "901.2636692650334"
      },
      {
        "name": "Quartile3MutualInformation",
        "value": "0.0206465881071925"
      },
      {
        "name": "Quartile3SkewnessOfNumericAtts",
        "value": "3.7546438249219056"
      },
      {
        "name": "Quartile3StdDevOfNumericAtts",
        "value": "771.8590427889504"
      },
      {
        "name": "StdvNominalAttDistinctValues",
        "value": "1.5576059718800395"
      }
    ]
  }
}