{
  "data_set_description": {
    "default_target_attribute": "Class",
    "description": "software fault prediction",
    "description_version": "1",
    "file_id": "5886355",
    "format": "ARFF",
    "id": "40847",
    "licence": "Public",
    "md5_checksum": "7a83c45e5ef4aef0711681ac736d8d7f",
    "minio_url": "https://data.openml.org/datasets/0004/40847/dataset_40847.pq",
    "name": "synapse-1.1",
    "parquet_url": "https://data.openml.org/datasets/0004/40847/dataset_40847.pq",
    "processing_date": "2018-10-04 07:15:56",
    "status": "in_preparation",
    "upload_date": "2017-06-23T18:46:26",
    "url": "https://api.openml.org/data/v1/download/5886355/synapse-1.1.arff",
    "version": "1",
    "visibility": "public"
  }
}