{
  "data_qualities": {
    "quality": [
      {
        "name": "AutoCorrelation",
        "value": "0.8273143190888738"
      },
      {
        "name": "ClassEntropy",
        "value": "0.514382805100229"
      },
      {
        "name": "Dimensionality",
        "value": "0.0021413276231263384"
      },
      {
        "name": "EquivalentNumberOfAtts",
        "value": []
      },
      {
        "name": "MajorityClassPercentage",
        "value": "88.51469729414056"
      },
      {
        "name": "MajorityClassSize",
        "value": "9094.0"
      },
      {
        "name": "MaxAttributeEntropy",
        "value": []
      },
      {
        "name": "MaxKurtosisOfNumericAtts",
        "value": "6574.498833835811"
      },
      {
        "name": "MaxMeansOfNumericAtts",
        "value": "246.115923690869"
      },
      {
        "name": "MaxMutualInformation",
        "value": []
      },
      {
        "name": "MaxNominalAttDistinctValues",
        "value": "2.0"
      },
      {
        "name": "MaxSkewnessOfNumericAtts",
        "value": "77.09887019113044"
      },
      {
        "name": "MaxStdDevOfNumericAtts",
        "value": "309.2384061813832"
      },
      {
        "name": "MeanAttributeEntropy",
        "value": []
      },
      {
        "name": "MeanKurtosisOfNumericAtts",
        "value": "449.2629236192199"
      },
      {
        "name": "MeanMeansOfNumericAtts",
        "value": "25.175707080874478"
      },
      {
        "name": "MeanMutualInformation",
        "value": []
      },
      {
        "name": "MeanNoiseToSignalRatio",
        "value": []
      },
      {
        "name": "MeanNominalAttDistinctValues",
        "value": "2.0"
      },
      {
        "name": "MeanSkewnessOfNumericAtts",
        "value": "10.058182328074484"
      },
      {
        "name": "MeanStdDevOfNumericAtts",
        "value": "31.3742699300068"
      },
      {
        "name": "MinAttributeEntropy",
        "value": []
      },
      {
        "name": "MinKurtosisOfNumericAtts",
        "value": "-1.7066272650316867"
      },
      {
        "name": "MinMeansOfNumericAtts",
        "value": "0.06667315553825377"
      },
      {
        "name": "MinMutualInformation",
        "value": []
      },
      {
        "name": "MinNominalAttDistinctValues",
        "value": "2.0"
      },
      {
        "name": "MinSkewnessOfNumericAtts",
        "value": "-1.2703209063772078"
      },
      {
        "name": "MinStdDevOfNumericAtts",
        "value": "0.21494837804166106"
      },
      {
        "name": "MinorityClassPercentage",
        "value": "11.485302705859452"
      },
      {
        "name": "MinorityClassSize",
        "value": "1180.0"
      },
      {
        "name": "NumberOfBinaryFeatures",
        "value": "1.0"
      },
      {
        "name": "NumberOfClasses",
        "value": "2.0"
      },
      {
        "name": "NumberOfFeatures",
        "value": "22.0"
      },
      {
        "name": "NumberOfInstances",
        "value": "10274.0"
      },
      {
        "name": "NumberOfInstancesWithMissingValues",
        "value": "0.0"
      },
      {
        "name": "NumberOfMissingValues",
        "value": "0.0"
      },
      {
        "name": "NumberOfNumericFeatures",
        "value": "21.0"
      },
      {
        "name": "NumberOfSymbolicFeatures",
        "value": "1.0"
      },
      {
        "name": "PercentageOfBinaryFeatures",
        "value": "4.545454545454546"
      },
      {
        "name": "PercentageOfInstancesWithMissingValues",
        "value": "0.0"
      },
      {
        "name": "PercentageOfMissingValues",
        "value": "0.0"
      },
      {
        "name": "PercentageOfNumericFeatures",
        "value": "95.45454545454545"
      },
      {
        "name": "PercentageOfSymbolicFeatures",
        "value": "4.545454545454546"
      },
      {
        "name": "Quartile1AttributeEntropy",
        "value": []
      },
      {
        "name": "Quartile1KurtosisOfNumericAtts",
        "value": "0.4976478006672107"
      },
      {
        "name": "Quartile1MeansOfNumericAtts",
        "value": "0.9706019776620635"
      },
      {
        "name": "Quartile1MutualInformation",
        "value": []
      },
      {
        "name": "Quartile1SkewnessOfNumericAtts",
        "value": "0.3266702768402747"
      },
      {
        "name": "Quartile1StdDevOfNumericAtts",
        "value": "1.264835773581698"
      },
      {
        "name": "Quartile2AttributeEntropy",
        "value": []
      },
      {
        "name": "Quartile2KurtosisOfNumericAtts",
        "value": "33.08581114934828"
      },
      {
        "name": "Quartile2MeansOfNumericAtts",
        "value": "2.6372396340276394"
      },
      {
        "name": "Quartile2MutualInformation",
        "value": []
      },
      {
        "name": "Quartile2SkewnessOfNumericAtts",
        "value": "4.217555985956175"
      },
      {
        "name": "Quartile2StdDevOfNumericAtts",
        "value": "4.713330408971237"
      },
      {
        "name": "Quartile3AttributeEntropy",
        "value": []
      },
      {
        "name": "Quartile3KurtosisOfNumericAtts",
        "value": "213.70537900633735"
      },
      {
        "name": "Quartile3MeansOfNumericAtts",
        "value": "17.0699824800468"
      },
      {
        "name": "Quartile3MutualInformation",
        "value": []
      },
      {
        "name": "Quartile3SkewnessOfNumericAtts",
        "value": "12.422578756040764"
      },
      {
        "name": "Quartile3StdDevOfNumericAtts",
        "value": "15.522134147835787"
      },
      {
        "name": "StdvNominalAttDistinctValues",
        "value": "0.0"
      }
    ]
  }
}