{
  "data_qualities": {
    "quality": [
      {
        "name": "AutoCorrelation",
        "value": "0.5306122448979592"
      },
      {
        "name": "ClassEntropy",
        "value": "0.9461572802997267"
      },
      {
        "name": "Dimensionality",
        "value": "0.04751131221719457"
      },
      {
        "name": "EquivalentNumberOfAtts",
        "value": []
      },
      {
        "name": "MajorityClassPercentage",
        "value": "63.57466063348416"
      },
      {
        "name": "MajorityClassSize",
        "value": "281.0"
      },
      {
        "name": "MaxAttributeEntropy",
        "value": []
      },
      {
        "name": "MaxKurtosisOfNumericAtts",
        "value": "310.9804648606422"
      },
      {
        "name": "MaxMeansOfNumericAtts",
        "value": "292.59502262443425"
      },
      {
        "name": "MaxMutualInformation",
        "value": []
      },
      {
        "name": "MaxNominalAttDistinctValues",
        "value": "2.0"
      },
      {
        "name": "MaxSkewnessOfNumericAtts",
        "value": "16.842176436096135"
      },
      {
        "name": "MaxStdDevOfNumericAtts",
        "value": "631.6748756651623"
      },
      {
        "name": "MeanAttributeEntropy",
        "value": []
      },
      {
        "name": "MeanKurtosisOfNumericAtts",
        "value": "69.67762537914466"
      },
      {
        "name": "MeanMeansOfNumericAtts",
        "value": "25.074608761877812"
      },
      {
        "name": "MeanMutualInformation",
        "value": []
      },
      {
        "name": "MeanNoiseToSignalRatio",
        "value": []
      },
      {
        "name": "MeanNominalAttDistinctValues",
        "value": "2.0"
      },
      {
        "name": "MeanSkewnessOfNumericAtts",
        "value": "5.869152517731097"
      },
      {
        "name": "MeanStdDevOfNumericAtts",
        "value": "62.37102165027987"
      },
      {
        "name": "MinAttributeEntropy",
        "value": []
      },
      {
        "name": "MinKurtosisOfNumericAtts",
        "value": "-1.5860547215099818"
      },
      {
        "name": "MinMeansOfNumericAtts",
        "value": "0.3583802081447964"
      },
      {
        "name": "MinMutualInformation",
        "value": []
      },
      {
        "name": "MinNominalAttDistinctValues",
        "value": "2.0"
      },
      {
        "name": "MinSkewnessOfNumericAtts",
        "value": "0.1032287218991377"
      },
      {
        "name": "MinStdDevOfNumericAtts",
        "value": "0.20828811358297547"
      },
      {
        "name": "MinorityClassPercentage",
        "value": "36.425339366515836"
      },
      {
        "name": "MinorityClassSize",
        "value": "161.0"
      },
      {
        "name": "NumberOfBinaryFeatures",
        "value": "1.0"
      },
      {
        "name": "NumberOfClasses",
        "value": "2.0"
      },
      {
        "name": "NumberOfFeatures",
        "value": "21.0"
      },
      {
        "name": "NumberOfInstances",
        "value": "442.0"
      },
      {
        "name": "NumberOfInstancesWithMissingValues",
        "value": "0.0"
      },
      {
        "name": "NumberOfMissingValues",
        "value": "0.0"
      },
      {
        "name": "NumberOfNumericFeatures",
        "value": "20.0"
      },
      {
        "name": "NumberOfSymbolicFeatures",
        "value": "1.0"
      },
      {
        "name": "PercentageOfBinaryFeatures",
        "value": "4.761904761904762"
      },
      {
        "name": "PercentageOfInstancesWithMissingValues",
        "value": "0.0"
      },
      {
        "name": "PercentageOfMissingValues",
        "value": "0.0"
      },
      {
        "name": "PercentageOfNumericFeatures",
        "value": "95.23809523809523"
      },
      {
        "name": "PercentageOfSymbolicFeatures",
        "value": "4.761904761904762"
      },
      {
        "name": "Quartile1AttributeEntropy",
        "value": []
      },
      {
        "name": "Quartile1KurtosisOfNumericAtts",
        "value": "2.4045569629940284"
      },
      {
        "name": "Quartile1MeansOfNumericAtts",
        "value": "0.7567873303167427"
      },
      {
        "name": "Quartile1MutualInformation",
        "value": []
      },
      {
        "name": "Quartile1SkewnessOfNumericAtts",
        "value": "1.445724580422507"
      },
      {
        "name": "Quartile1StdDevOfNumericAtts",
        "value": "0.6287420132351831"
      },
      {
        "name": "Quartile2AttributeEntropy",
        "value": []
      },
      {
        "name": "Quartile2KurtosisOfNumericAtts",
        "value": "47.192879153369915"
      },
      {
        "name": "Quartile2MeansOfNumericAtts",
        "value": "2.8280542986425337"
      },
      {
        "name": "Quartile2MutualInformation",
        "value": []
      },
      {
        "name": "Quartile2SkewnessOfNumericAtts",
        "value": "6.09265642392001"
      },
      {
        "name": "Quartile2StdDevOfNumericAtts",
        "value": "7.338099546172332"
      },
      {
        "name": "Quartile3AttributeEntropy",
        "value": []
      },
      {
        "name": "Quartile3KurtosisOfNumericAtts",
        "value": "121.67544437874422"
      },
      {
        "name": "Quartile3MeansOfNumericAtts",
        "value": "13.031674208144805"
      },
      {
        "name": "Quartile3MutualInformation",
        "value": []
      },
      {
        "name": "Quartile3SkewnessOfNumericAtts",
        "value": "9.361739841639027"
      },
      {
        "name": "Quartile3StdDevOfNumericAtts",
        "value": "19.093526338441567"
      },
      {
        "name": "StdvNominalAttDistinctValues",
        "value": "0.0"
      }
    ]
  }
}