{
  "data_qualities": {
    "quality": [
      {
        "name": "AutoCorrelation",
        "value": "0.7891373801916933"
      },
      {
        "name": "ClassEntropy",
        "value": "0.5231036962677533"
      },
      {
        "name": "Dimensionality",
        "value": "0.06687898089171974"
      },
      {
        "name": "EquivalentNumberOfAtts",
        "value": []
      },
      {
        "name": "MajorityClassPercentage",
        "value": "88.21656050955414"
      },
      {
        "name": "MajorityClassSize",
        "value": "277.0"
      },
      {
        "name": "MaxAttributeEntropy",
        "value": []
      },
      {
        "name": "MaxKurtosisOfNumericAtts",
        "value": "226.4164830284583"
      },
      {
        "name": "MaxMeansOfNumericAtts",
        "value": "296.72292993630566"
      },
      {
        "name": "MaxMutualInformation",
        "value": []
      },
      {
        "name": "MaxNominalAttDistinctValues",
        "value": "2.0"
      },
      {
        "name": "MaxSkewnessOfNumericAtts",
        "value": "14.498654182517791"
      },
      {
        "name": "MaxStdDevOfNumericAtts",
        "value": "661.2989562734733"
      },
      {
        "name": "MeanAttributeEntropy",
        "value": []
      },
      {
        "name": "MeanKurtosisOfNumericAtts",
        "value": "61.08097728956537"
      },
      {
        "name": "MeanMeansOfNumericAtts",
        "value": "25.29137223821656"
      },
      {
        "name": "MeanMutualInformation",
        "value": []
      },
      {
        "name": "MeanNoiseToSignalRatio",
        "value": []
      },
      {
        "name": "MeanNominalAttDistinctValues",
        "value": "2.0"
      },
      {
        "name": "MeanSkewnessOfNumericAtts",
        "value": "5.47451129185327"
      },
      {
        "name": "MeanStdDevOfNumericAtts",
        "value": "59.17264819797154"
      },
      {
        "name": "MinAttributeEntropy",
        "value": []
      },
      {
        "name": "MinKurtosisOfNumericAtts",
        "value": "-1.827727128297332"
      },
      {
        "name": "MinMeansOfNumericAtts",
        "value": "0.30018195859872615"
      },
      {
        "name": "MinMutualInformation",
        "value": []
      },
      {
        "name": "MinNominalAttDistinctValues",
        "value": "2.0"
      },
      {
        "name": "MinSkewnessOfNumericAtts",
        "value": "-0.11576047073097381"
      },
      {
        "name": "MinStdDevOfNumericAtts",
        "value": "0.18719253945484174"
      },
      {
        "name": "MinorityClassPercentage",
        "value": "11.78343949044586"
      },
      {
        "name": "MinorityClassSize",
        "value": "37.0"
      },
      {
        "name": "NumberOfBinaryFeatures",
        "value": "1.0"
      },
      {
        "name": "NumberOfClasses",
        "value": "2.0"
      },
      {
        "name": "NumberOfFeatures",
        "value": "21.0"
      },
      {
        "name": "NumberOfInstances",
        "value": "314.0"
      },
      {
        "name": "NumberOfInstancesWithMissingValues",
        "value": "0.0"
      },
      {
        "name": "NumberOfMissingValues",
        "value": "0.0"
      },
      {
        "name": "NumberOfNumericFeatures",
        "value": "20.0"
      },
      {
        "name": "NumberOfSymbolicFeatures",
        "value": "1.0"
      },
      {
        "name": "PercentageOfBinaryFeatures",
        "value": "4.761904761904762"
      },
      {
        "name": "PercentageOfInstancesWithMissingValues",
        "value": "0.0"
      },
      {
        "name": "PercentageOfMissingValues",
        "value": "0.0"
      },
      {
        "name": "PercentageOfNumericFeatures",
        "value": "95.23809523809523"
      },
      {
        "name": "PercentageOfSymbolicFeatures",
        "value": "4.761904761904762"
      },
      {
        "name": "Quartile1AttributeEntropy",
        "value": []
      },
      {
        "name": "Quartile1KurtosisOfNumericAtts",
        "value": "0.7247232199222442"
      },
      {
        "name": "Quartile1MeansOfNumericAtts",
        "value": "0.7983932364649658"
      },
      {
        "name": "Quartile1MutualInformation",
        "value": []
      },
      {
        "name": "Quartile1SkewnessOfNumericAtts",
        "value": "0.8998656610756387"
      },
      {
        "name": "Quartile1StdDevOfNumericAtts",
        "value": "0.5574551304576776"
      },
      {
        "name": "Quartile2AttributeEntropy",
        "value": []
      },
      {
        "name": "Quartile2KurtosisOfNumericAtts",
        "value": "41.044796659174494"
      },
      {
        "name": "Quartile2MeansOfNumericAtts",
        "value": "3.1003184713375793"
      },
      {
        "name": "Quartile2MutualInformation",
        "value": []
      },
      {
        "name": "Quartile2SkewnessOfNumericAtts",
        "value": "5.721641465465952"
      },
      {
        "name": "Quartile2StdDevOfNumericAtts",
        "value": "7.6521973914990165"
      },
      {
        "name": "Quartile3AttributeEntropy",
        "value": []
      },
      {
        "name": "Quartile3KurtosisOfNumericAtts",
        "value": "94.879718099765"
      },
      {
        "name": "Quartile3MeansOfNumericAtts",
        "value": "13.75796178343949"
      },
      {
        "name": "Quartile3MutualInformation",
        "value": []
      },
      {
        "name": "Quartile3SkewnessOfNumericAtts",
        "value": "8.617782221578404"
      },
      {
        "name": "Quartile3StdDevOfNumericAtts",
        "value": "16.198915102922506"
      },
      {
        "name": "StdvNominalAttDistinctValues",
        "value": "0.0"
      }
    ]
  }
}