{
  "data_set_description": {
    "default_target_attribute": "Class",
    "description": "software fault prediction",
    "description_version": "1",
    "file_id": "5882476",
    "format": "ARFF",
    "id": "40802",
    "licence": "Public",
    "md5_checksum": "6e231fde1b5151fe2d82a7996c4eb5da",
    "minio_url": "https://data.openml.org/datasets/0004/40802/dataset_40802.pq",
    "name": "camel-1.2",
    "parquet_url": "https://data.openml.org/datasets/0004/40802/dataset_40802.pq",
    "processing_date": "2018-10-04 07:19:00",
    "status": "in_preparation",
    "tag": "origin_unknown",
    "upload_date": "2017-06-23T17:03:42",
    "url": "https://api.openml.org/data/v1/download/5882476/camel-1.2.arff",
    "version": "1",
    "visibility": "public"
  }
}