{
  "data_qualities": {
    "quality": [
      {
        "name": "AutoCorrelation",
        "value": "0.6981132075471698"
      },
      {
        "name": "ClassEntropy",
        "value": "0.6949749673676273"
      },
      {
        "name": "Dimensionality",
        "value": "0.2803738317757009"
      },
      {
        "name": "EquivalentNumberOfAtts",
        "value": []
      },
      {
        "name": "MajorityClassPercentage",
        "value": "81.30841121495327"
      },
      {
        "name": "MajorityClassSize",
        "value": "87.0"
      },
      {
        "name": "MaxAttributeEntropy",
        "value": []
      },
      {
        "name": "MaxKurtosisOfNumericAtts",
        "value": "46.37729338323083"
      },
      {
        "name": "MaxMeansOfNumericAtts",
        "value": "15184.85171775701"
      },
      {
        "name": "MaxMutualInformation",
        "value": []
      },
      {
        "name": "MaxNominalAttDistinctValues",
        "value": "2.0"
      },
      {
        "name": "MaxSkewnessOfNumericAtts",
        "value": "6.780959601458589"
      },
      {
        "name": "MaxStdDevOfNumericAtts",
        "value": "39411.80264889062"
      },
      {
        "name": "MeanAttributeEntropy",
        "value": []
      },
      {
        "name": "MeanKurtosisOfNumericAtts",
        "value": "18.377073757815985"
      },
      {
        "name": "MeanMeansOfNumericAtts",
        "value": "594.8054013132775"
      },
      {
        "name": "MeanMutualInformation",
        "value": []
      },
      {
        "name": "MeanNoiseToSignalRatio",
        "value": []
      },
      {
        "name": "MeanNominalAttDistinctValues",
        "value": "2.0"
      },
      {
        "name": "MeanSkewnessOfNumericAtts",
        "value": "3.3574185348782017"
      },
      {
        "name": "MeanStdDevOfNumericAtts",
        "value": "1490.8075318664821"
      },
      {
        "name": "MinAttributeEntropy",
        "value": []
      },
      {
        "name": "MinKurtosisOfNumericAtts",
        "value": "-0.1363232318936829"
      },
      {
        "name": "MinMeansOfNumericAtts",
        "value": "0.10163881775700935"
      },
      {
        "name": "MinMutualInformation",
        "value": []
      },
      {
        "name": "MinNominalAttDistinctValues",
        "value": "2.0"
      },
      {
        "name": "MinSkewnessOfNumericAtts",
        "value": "-0.44957177867622905"
      },
      {
        "name": "MinStdDevOfNumericAtts",
        "value": "0.047394400427191646"
      },
      {
        "name": "MinorityClassPercentage",
        "value": "18.69158878504673"
      },
      {
        "name": "MinorityClassSize",
        "value": "20.0"
      },
      {
        "name": "NumberOfBinaryFeatures",
        "value": "1.0"
      },
      {
        "name": "NumberOfClasses",
        "value": "2.0"
      },
      {
        "name": "NumberOfFeatures",
        "value": "30.0"
      },
      {
        "name": "NumberOfInstances",
        "value": "107.0"
      },
      {
        "name": "NumberOfInstancesWithMissingValues",
        "value": "0.0"
      },
      {
        "name": "NumberOfMissingValues",
        "value": "0.0"
      },
      {
        "name": "NumberOfNumericFeatures",
        "value": "29.0"
      },
      {
        "name": "NumberOfSymbolicFeatures",
        "value": "1.0"
      },
      {
        "name": "PercentageOfBinaryFeatures",
        "value": "3.3333333333333335"
      },
      {
        "name": "PercentageOfInstancesWithMissingValues",
        "value": "0.0"
      },
      {
        "name": "PercentageOfMissingValues",
        "value": "0.0"
      },
      {
        "name": "PercentageOfNumericFeatures",
        "value": "96.66666666666667"
      },
      {
        "name": "PercentageOfSymbolicFeatures",
        "value": "3.3333333333333335"
      },
      {
        "name": "Quartile1AttributeEntropy",
        "value": []
      },
      {
        "name": "Quartile1KurtosisOfNumericAtts",
        "value": "4.174084212095824"
      },
      {
        "name": "Quartile1MeansOfNumericAtts",
        "value": "0.7054056728971962"
      },
      {
        "name": "Quartile1MutualInformation",
        "value": []
      },
      {
        "name": "Quartile1SkewnessOfNumericAtts",
        "value": "1.756347899512122"
      },
      {
        "name": "Quartile1StdDevOfNumericAtts",
        "value": "1.534300633992924"
      },
      {
        "name": "Quartile2AttributeEntropy",
        "value": []
      },
      {
        "name": "Quartile2KurtosisOfNumericAtts",
        "value": "17.25002375201764"
      },
      {
        "name": "Quartile2MeansOfNumericAtts",
        "value": "11.242990654205608"
      },
      {
        "name": "Quartile2MutualInformation",
        "value": []
      },
      {
        "name": "Quartile2SkewnessOfNumericAtts",
        "value": "3.6360931725628554"
      },
      {
        "name": "Quartile2StdDevOfNumericAtts",
        "value": "15.624325765738726"
      },
      {
        "name": "Quartile3AttributeEntropy",
        "value": []
      },
      {
        "name": "Quartile3KurtosisOfNumericAtts",
        "value": "26.34832650596792"
      },
      {
        "name": "Quartile3MeansOfNumericAtts",
        "value": "50.13084112149532"
      },
      {
        "name": "Quartile3MutualInformation",
        "value": []
      },
      {
        "name": "Quartile3SkewnessOfNumericAtts",
        "value": "4.3890600712538985"
      },
      {
        "name": "Quartile3StdDevOfNumericAtts",
        "value": "62.55694619391181"
      },
      {
        "name": "StdvNominalAttDistinctValues",
        "value": "0.0"
      }
    ]
  }
}