{
  "data_set_description": {
    "default_target_attribute": "class",
    "description": "The iris dataset",
    "description_version": "1",
    "file_id": "5798056",
    "format": "arff",
    "id": "40789",
    "licence": "Public",
    "md5_checksum": "b3cb8382b156d03d1e022c549a5770b5",
    "minio_url": "https://data.openml.org/datasets/0004/40789/dataset_40789.pq",
    "name": "Sami_DataSet",
    "parquet_url": "https://data.openml.org/datasets/0004/40789/dataset_40789.pq",
    "processing_date": "2018-10-04 07:16:44",
    "status": "deactivated",
    "tag": "derived",
    "upload_date": "2017-06-20T18:40:30",
    "url": "https://api.openml.org/data/v1/download/5798056/Sami_DataSet.arff",
    "version": "1",
    "visibility": "public"
  }
}