{
  "data_set_description": {
    "description": "Source:\n\nThe dataset was created by Tactile Srl, Brescia, Italy (http://www.tattile.it) and donated in 1994 to Semeion Research Center of Sciences of Communication, Rome, Italy (http://www.semeion.it), for machine learning research. \n\nFor any questions, e-mail Massimo Buscema (m.buscema '@' semeion.it) or Stefano Terzi (s.terzi '@' semeion.it)\n\n\nData Set Information:\n\n1593 handwritten digits from around 80 persons were scanned, stretched in a rectangular box 16x16 in a gray scale of 256 values.Then each pixel of each image was scaled into a bolean (1/0) value using a fixed threshold. \n\nEach person wrote on a paper all the digits from 0 to 9, twice. The commitment was to write the digit the first time in the normal way (trying to write each digit accurately) and the second time in a fast way (with no accuracy). \n\nThe best validation protocol for this dataset seems to be a 5x2CV, 50% Tune (Train +Test) and completly blind 50% Validation\n\n\nAttribute Information:\n\nThis dataset consists of 1593 records (rows) and 256 attributes (columns). \n\nEach record represents a handwritten digit, orginally scanned with a resolution of 256 grays scale (28). \n\nEach pixel of the each original scanned image was first stretched, and after scaled between 0 and 1 (setting to 0 every pixel whose value was under tha value 127 of the grey scale (127 included) and setting to 1 each pixel whose orinal value in the grey scale was over 127). \n\nFinally, each binary image was scaled again into a 16x16 square box (the final 256 binary attributes).\n\n#autoxgboost #autoweka",
    "description_version": "1",
    "file_id": "5797211",
    "format": "ARFF",
    "id": "40782",
    "licence": "Public",
    "md5_checksum": "0dd6569431efda65161173704466f8a5",
    "minio_url": "https://data.openml.org/datasets/0004/40782/dataset_40782.pq",
    "name": "Semeion-test",
    "parquet_url": "https://data.openml.org/datasets/0004/40782/dataset_40782.pq",
    "processing_date": "2018-10-30 00:46:33",
    "status": "in_preparation",
    "tag": "derived",
    "upload_date": "2017-06-20T11:33:32",
    "url": "https://api.openml.org/data/v1/download/5797211/Semeion-test.arff",
    "version": "1",
    "visibility": "public"
  }
}