{
  "data_qualities": {
    "quality": [
      {
        "name": "AutoCorrelation",
        "value": []
      },
      {
        "name": "ClassEntropy",
        "value": []
      },
      {
        "name": "Dimensionality",
        "value": "1.020612244897959"
      },
      {
        "name": "EquivalentNumberOfAtts",
        "value": []
      },
      {
        "name": "MajorityClassPercentage",
        "value": []
      },
      {
        "name": "MajorityClassSize",
        "value": []
      },
      {
        "name": "MaxAttributeEntropy",
        "value": []
      },
      {
        "name": "MaxKurtosisOfNumericAtts",
        "value": "4900.000000001783"
      },
      {
        "name": "MaxMeansOfNumericAtts",
        "value": "800.2716326530614"
      },
      {
        "name": "MaxMutualInformation",
        "value": []
      },
      {
        "name": "MaxNominalAttDistinctValues",
        "value": "2.0"
      },
      {
        "name": "MaxSkewnessOfNumericAtts",
        "value": "70.00000000004174"
      },
      {
        "name": "MaxStdDevOfNumericAtts",
        "value": "464.323032871019"
      },
      {
        "name": "MeanAttributeEntropy",
        "value": []
      },
      {
        "name": "MeanKurtosisOfNumericAtts",
        "value": "263.3787547955861"
      },
      {
        "name": "MeanMeansOfNumericAtts",
        "value": "106.12271906122449"
      },
      {
        "name": "MeanMutualInformation",
        "value": []
      },
      {
        "name": "MeanNoiseToSignalRatio",
        "value": []
      },
      {
        "name": "MeanNominalAttDistinctValues",
        "value": "2.0"
      },
      {
        "name": "MeanSkewnessOfNumericAtts",
        "value": "8.64009109567762"
      },
      {
        "name": "MeanStdDevOfNumericAtts",
        "value": "215.1996846982453"
      },
      {
        "name": "MinAttributeEntropy",
        "value": []
      },
      {
        "name": "MinKurtosisOfNumericAtts",
        "value": "-1.8979644526346986"
      },
      {
        "name": "MinMeansOfNumericAtts",
        "value": "0.0"
      },
      {
        "name": "MinMutualInformation",
        "value": []
      },
      {
        "name": "MinNominalAttDistinctValues",
        "value": "2.0"
      },
      {
        "name": "MinSkewnessOfNumericAtts",
        "value": "-1.6785001289771673"
      },
      {
        "name": "MinStdDevOfNumericAtts",
        "value": "0.0"
      },
      {
        "name": "MinorityClassPercentage",
        "value": []
      },
      {
        "name": "MinorityClassSize",
        "value": []
      },
      {
        "name": "NumberOfBinaryFeatures",
        "value": "1.0"
      },
      {
        "name": "NumberOfClasses",
        "value": []
      },
      {
        "name": "NumberOfFeatures",
        "value": "5001.0"
      },
      {
        "name": "NumberOfInstances",
        "value": "4900.0"
      },
      {
        "name": "NumberOfInstancesWithMissingValues",
        "value": "0.0"
      },
      {
        "name": "NumberOfMissingValues",
        "value": "0.0"
      },
      {
        "name": "NumberOfNumericFeatures",
        "value": "5000.0"
      },
      {
        "name": "NumberOfSymbolicFeatures",
        "value": "1.0"
      },
      {
        "name": "PercentageOfBinaryFeatures",
        "value": "0.01999600079984003"
      },
      {
        "name": "PercentageOfInstancesWithMissingValues",
        "value": "0.0"
      },
      {
        "name": "PercentageOfMissingValues",
        "value": "0.0"
      },
      {
        "name": "PercentageOfNumericFeatures",
        "value": "99.98000399920016"
      },
      {
        "name": "PercentageOfSymbolicFeatures",
        "value": "0.01999600079984003"
      },
      {
        "name": "Quartile1AttributeEntropy",
        "value": []
      },
      {
        "name": "Quartile1KurtosisOfNumericAtts",
        "value": "0.9288717392302055"
      },
      {
        "name": "Quartile1MeansOfNumericAtts",
        "value": "10.920561224489749"
      },
      {
        "name": "Quartile1MutualInformation",
        "value": []
      },
      {
        "name": "Quartile1SkewnessOfNumericAtts",
        "value": "1.6405688912591339"
      },
      {
        "name": "Quartile1StdDevOfNumericAtts",
        "value": "92.61952427143288"
      },
      {
        "name": "Quartile2AttributeEntropy",
        "value": []
      },
      {
        "name": "Quartile2KurtosisOfNumericAtts",
        "value": "10.098908481800354"
      },
      {
        "name": "Quartile2MeansOfNumericAtts",
        "value": "59.99704081632644"
      },
      {
        "name": "Quartile2MutualInformation",
        "value": []
      },
      {
        "name": "Quartile2SkewnessOfNumericAtts",
        "value": "3.398219871788113"
      },
      {
        "name": "Quartile2StdDevOfNumericAtts",
        "value": "212.4368144483679"
      },
      {
        "name": "Quartile3AttributeEntropy",
        "value": []
      },
      {
        "name": "Quartile3KurtosisOfNumericAtts",
        "value": "71.7364155145101"
      },
      {
        "name": "Quartile3MeansOfNumericAtts",
        "value": "165.2110204081635"
      },
      {
        "name": "Quartile3MutualInformation",
        "value": []
      },
      {
        "name": "Quartile3SkewnessOfNumericAtts",
        "value": "8.40196969156102"
      },
      {
        "name": "Quartile3StdDevOfNumericAtts",
        "value": "333.89411589399685"
      },
      {
        "name": "StdvNominalAttDistinctValues",
        "value": "0.0"
      }
    ]
  }
}