{
  "data_set_description": {
    "description": "Recognition of convex sets\nThe convex sets consist of a single convex region with pixels of value 255. Candidate convex images were constructed by taking the intersection of a number of half-planes whose location and orientation were chosen uniformly at random. The number of intersecting half-planes was also sampled randomly according to a geometric distribution with parameter 0.195. A candidate convex image was rejected if there were less than 19 pixels in the convex region.\nCandidate non-convex images were constructed by taking the union of a random number of convex sets generated as above, but with the number of half-planes sampled from a geometric distribution with parameter 0.07 and with a minimum number of 10 pixels. The number of convex sets was sampled uniformly from 2 to 4. The candidate non-convex images were then tested by checking a convexity condition for every pair of pixels in the non-convex set. Those sets that failed the convexity test were added to the dataset.\nThe parameters for generating the convex and non-convex sets were balanced to ensure that the mean number of pixels of value 255 is the same in the two datasets.\n\n#autoxgboost #autoweka",
    "description_version": "1",
    "file_id": "5797167",
    "format": "ARFF",
    "id": "40765",
    "licence": "Public",
    "md5_checksum": "635af2ae3d8359c700747f551c42eea1",
    "minio_url": "https://data.openml.org/datasets/0004/40765/dataset_40765.pq",
    "name": "Convex-train",
    "parquet_url": "https://data.openml.org/datasets/0004/40765/dataset_40765.pq",
    "processing_date": "2018-10-30 00:46:39",
    "status": "in_preparation",
    "tag": [
      "artificial",
      "derived",
      "origin_unknown"
    ],
    "upload_date": "2017-06-20T11:19:53",
    "url": "https://api.openml.org/data/v1/download/5797167/Convex-train.arff",
    "version": "1",
    "visibility": "public"
  }
}