{
  "data_set_description": {
    "citation": "https://github.com/OpenDataDayZurich2016/ODDPredictDelays",
    "contributor": "https://github.com/OpenDataDayZurich2016/ODDPredictDelays/graphs/contributors",
    "default_target_attribute": "delay",
    "description": "Zurich public transport delay data 2016-10-30 03:30:00 CET - 2016-11-27 01:20:00 CET cleaned and prepared at Open Data Day 2017.",
    "description_version": "1",
    "file_id": "5698591",
    "format": "ARFF",
    "id": "40753",
    "licence": "CCZero",
    "md5_checksum": "f69906f0cef54561e917888211135834",
    "minio_url": "https://data.openml.org/datasets/0004/40753/dataset_40753.pq",
    "name": "delays_zurich_transport",
    "original_data_url": "https://data.stadt-zuerich.ch/dataset/vbz-fahrzeiten-ogd",
    "parquet_url": "https://data.openml.org/datasets/0004/40753/dataset_40753.pq",
    "processing_date": "2018-10-04 07:14:03",
    "status": "active",
    "upload_date": "2017-06-01T16:41:17",
    "url": "https://api.openml.org/data/v1/download/5698591/delays_zurich_transport.arff",
    "version": "1",
    "visibility": "public"
  }
}