"Annotation","C1","C2","C3 (en)","C3 (es)","M1","M2","M3","M4(en)","M4(es)","M5(en)","M5(es)","TB1","TB2","TB3","TB4","TB5","TB6","TB7","TB8","TB9","TB10","TB11"
Correct,0.0001,0.9999,0,0.9973,17545,1,17544,0,17498,17545,17545,0,0,0,0,0,0,0,0,0,0,0
Correct,0.0001,1,0.0403,0.9953,7645,1,7645,308,7609,7645,7645,0,0,0,0,0,0,0,0,0,0,0
Incorrect,0.8291,0.9615,0,0,6262,5192,6021,0,0,6262,6262,0,0,0,0,0,0,0,0,1,0,0
Correct,0.0009,0.9998,0.7229,0,5793,5,5792,4188,0,5793,5793,0,0,0,0,0,0,0,0,0,0,0
Correct,0.0519,0.9556,0.7371,0.9661,6017,312,5750,4435,5813,6017,6017,0,0,1,0,0,0,0,0,0,0,0
Correct,0.884,0.9342,0.8673,0,5923,5236,5533,5137,0,5923,5923,0,0,0,0,0,1,0,0,0,0,0
Correct,0.8058,0.9166,0.8673,0,5923,4773,5429,5137,0,5923,5923,0,0,0,0,0,1,0,0,0,0,0
Correct,0.0141,0.9569,0.5668,0.9585,5522,78,5284,3130,5293,5522,5522,0,0,1,0,0,1,0,0,0,0,0
Correct,0.0022,0.9982,0.0507,0,4973,11,4964,252,0,4973,4973,0,0,0,0,0,0,0,0,1,0,0
Correct,0.0744,0.945,0.8526,0.9662,5204,387,4918,4437,5028,5204,5204,0,0,1,0,0,0,0,0,0,0,0
Correct,0.0002,0.9998,0.0527,0,4835,1,4834,255,0,4835,4835,0,0,0,0,0,0,0,0,0,0,0
Correct,0.077,0.9562,0.597,0.9646,5000,385,4781,2985,4823,5000,5000,0,0,1,0,0,1,0,0,0,0,0
Correct,0.0902,0.9579,0.5078,0.9686,4677,422,4480,2375,4530,4677,4677,0,0,1,0,0,1,0,0,0,0,0
Correct,0.0009,0.9596,0.1569,0.9883,4352,4,4176,683,4301,4352,4352,0,0,1,0,0,0,0,0,0,0,0
Correct,0.021,0.9326,0.6197,0.9613,4420,93,4122,2739,4249,4420,4420,0,0,1,0,0,0,0,0,0,0,0
Incorrect,0.1263,0.9139,0,0,3856,487,3524,0,0,3856,3856,0,0,0,0,0,0,0,0,1,0,0
Correct,0.1132,0.9299,0.8539,0.8924,3764,426,3500,3214,3359,3764,3764,0,0,1,0,0,1,0,0,0,0,0
Correct,0.0215,0.9285,0.1702,0.9624,3720,80,3454,633,3580,3720,3720,0,0,1,0,0,1,0,0,1,0,0
Correct,0.0214,0.9549,0.8758,0.9547,3551,76,3391,3110,3390,3551,3551,0,0,1,0,0,1,0,0,0,0,0
Correct,0.0243,0.9365,0.7948,0.9476,3495,85,3273,2778,3312,3495,3495,0,0,1,0,0,0,0,0,0,0,0
Correct,0.3321,0.7741,0.3632,0.7982,3984,1323,3084,1447,3180,3984,3984,0,0,1,0,0,0,0,0,0,0,0
Correct,0.0131,0.9617,0.0845,0.9837,3136,41,3016,265,3085,3136,3136,0,0,1,0,0,0,0,0,0,0,0
Correct,0.0257,0.9216,0.6327,0.8863,3150,81,2903,1993,2792,3150,3150,0,0,1,0,0,1,0,0,0,0,0
Incorrect,0.0011,0.9989,0.9799,0,2841,3,2838,2784,0,2841,2841,0,0,1,0,0,0,0,0,0,0,0
Correct,0.2282,0.994,0.0007,0.9246,2840,648,2823,2,2626,2840,2840,0,0,0,0,0,1,0,0,1,0,0
Correct,0.0004,0.9996,0.5602,0,2808,1,2807,1573,0,2808,2808,0,0,1,0,0,0,0,0,0,0,0
Correct,0.4936,0.631,0.3611,0.6473,4431,2187,2796,1600,2868,4431,4431,0,0,1,0,0,0,0,0,1,0,0
Correct,0.1435,0.9343,0.8555,0.8917,2983,428,2787,2552,2660,2983,2983,0,0,1,0,0,1,0,0,0,0,0
Correct,0.027,0.9442,0.6528,0.9507,2923,79,2760,1908,2779,2923,2923,0,0,1,0,0,1,0,0,0,0,0
Correct,0.0025,0.9985,0.5197,0.7828,2748,7,2744,1428,2151,2748,2748,0,0,1,0,0,0,0,0,0,0,0
Correct,0.0004,0.9996,0.9001,0,2733,1,2732,2460,0,2733,2733,0,0,1,0,0,0,0,0,0,0,0
Correct,0.0004,1,0.9805,0.8179,2719,1,2719,2666,2224,2719,2719,0,0,1,0,0,0,0,0,0,0,0
Correct,0.0187,0.9422,0.5767,0.9619,2837,53,2673,1636,2729,2837,2837,0,0,1,0,0,1,0,0,0,0,0
Correct,0.0034,0.9974,0.5244,0.8055,2679,9,2672,1405,2158,2679,2679,0,0,1,0,0,0,0,0,0,0,0
Correct,0.0034,0.95,0.1931,0.9702,2682,9,2548,518,2602,2682,2682,0,0,1,0,0,0,0,0,0,0,0
Correct,0.1377,0.9855,0.8027,0.0004,2549,351,2512,2046,1,2549,2549,0,0,1,0,0,1,0,0,0,0,0
Correct,0.175,0.9677,0.8437,0.8355,2572,450,2489,2170,2149,2572,2572,0,0,1,0,0,1,0,0,1,0,0
Correct,0.0045,0.8579,0.5421,0.8614,2900,13,2488,1572,2498,2900,2900,0,0,1,0,0,0,0,0,0,0,0
Correct,0.0209,0.9301,0.6614,0.8926,2634,55,2450,1742,2351,2634,2634,0,0,1,0,0,1,0,0,0,0,0
Correct,0.016,0.9198,0.5885,0,2620,42,2410,1542,0,2620,2620,0,0,1,0,0,0,0,0,0,0,0
Correct,0.0814,0.8826,0.0675,0.9109,2726,222,2406,184,2483,2726,2726,0,0,1,0,0,1,0,0,1,0,0
Correct,0.0153,0.921,0.2025,0.903,2608,40,2402,528,2355,2608,2608,0,0,1,0,0,0,0,0,1,0,0
Correct,0.1851,0.9737,0.9138,0.8235,2436,451,2372,2226,2006,2436,2436,0,0,1,0,0,1,0,0,1,0,0
Correct,0.0004,0.8886,0.2307,0.9894,2648,1,2353,611,2620,2648,2648,0,0,1,0,0,0,0,0,0,0,0
Correct,0.2786,0.8143,0.4516,0.8017,2854,795,2324,1289,2288,2854,2854,0,0,1,0,0,1,0,0,0,0,0
Correct,0.5708,0.6891,0,0,3297,1882,2272,0,0,3297,3297,0,0,0,0,0,0,0,0,0,0,0
Correct,0.0005,0.9995,0,0,2176,1,2175,0,0,2176,2176,0,0,1,0,0,0,0,0,0,0,0
Correct,0.0005,0.9995,0,0,2176,1,2175,0,0,2176,2176,0,0,1,0,0,0,0,0,0,0,0
Correct,0.0779,0.995,0.771,0,2183,170,2172,1683,0,2183,2183,0,0,0,0,0,1,0,0,0,0,0
Correct,0.0014,0.9995,0,0.8322,2139,3,2138,0,1780,2139,2139,0,0,1,0,0,0,0,0,0,0,0
Correct,0.0014,0.9995,0,0.8322,2139,3,2138,0,1780,2139,2139,0,0,1,0,0,0,0,0,0,0,0
Correct,0.0033,0.9976,0.9693,0.8637,2120,7,2115,2055,1831,2120,2120,0,0,1,0,0,1,0,0,1,0,0
Correct,0.0028,0.9976,0.9391,0.8876,2117,6,2112,1988,1879,2117,2117,0,0,1,0,0,1,0,0,1,0,0
Correct,0.0015,0.9995,0.7826,0,2065,3,2064,1616,0,2065,2065,0,0,1,0,0,0,0,0,0,0,0
Correct,0.3761,0.9908,0.8691,0.0652,2071,779,2052,1800,135,2071,2071,0,0,0,0,0,1,0,0,0,0,0
Correct,0.0024,0.999,0.9238,0.8045,2046,5,2044,1890,1646,2046,2046,0,0,1,0,0,0,0,0,0,0,0
Correct,0.5383,0.5378,0.4648,0.5574,3769,2029,2027,1752,2101,3769,3769,0,0,1,0,0,0,0,0,1,0,0
Correct,0.0124,0.9271,0.1865,0.9125,2182,27,2023,407,1991,2182,2182,0,0,1,0,0,0,0,0,0,0,0
Correct,0.3153,0.7951,0.5183,0.7875,2518,794,2002,1305,1983,2518,2518,0,0,1,0,0,1,0,0,0,0,0
Correct,0.0005,1,0.7948,0.8028,1998,1,1998,1588,1604,1998,1998,0,0,1,0,0,1,0,0,0,0,0
Correct,0.0015,1,0.7892,0.8305,1988,3,1988,1569,1651,1988,1988,0,0,1,0,0,1,0,0,0,0,0
Correct,0.0137,0.948,0.0922,0.9657,2039,28,1933,188,1969,2039,2039,0,0,1,0,0,0,0,0,0,0,0
Correct,0.0048,0.8404,0,0.8645,2280,11,1916,0,1971,2280,2280,0,0,1,0,0,0,0,0,0,0,0
Correct,0.0048,0.8404,0,0.8645,2280,11,1916,0,1971,2280,2280,0,0,1,0,0,0,0,0,0,0,0
Correct,0.0005,0.9812,0.8432,0,1920,1,1884,1619,0,1920,1920,0,0,0,0,0,1,0,0,0,0,0
Correct,0.4125,0.6378,0.5304,0.7003,2943,1214,1877,1561,2061,2943,2943,0,0,1,0,0,0,0,0,0,0,0
Correct,0.006,0.8532,0.7984,0.8684,2173,13,1854,1735,1887,2173,2173,0,0,1,0,0,0,0,0,0,0,0
Correct,0.0402,0.9995,0.6679,0,1840,74,1839,1229,0,1840,1840,0,0,0,0,0,1,0,0,0,0,0
Correct,0.1721,0.9053,0.8006,0.817,2016,347,1825,1614,1647,2016,2016,0,0,0,0,0,1,0,0,1,0,0
Correct,0.0039,1,0,0,1789,7,1789,0,0,1789,1789,0,0,0,0,0,0,0,0,0,0,0
Correct,0.0145,1,0,0,1789,26,1789,0,0,1789,1789,0,0,0,0,0,0,0,0,0,0,0
Correct,0.1757,0.9529,0.872,0.7429,1867,328,1779,1628,1387,1867,1867,0,0,0,0,0,1,0,0,1,0,0
Correct,0.0006,0.9994,0.9157,0.7969,1768,1,1767,1619,1409,1768,1768,0,0,1,0,0,1,0,0,0,0,0
Correct,0.0028,0.9977,0.9363,0.802,1758,5,1754,1646,1410,1758,1758,0,0,1,0,0,1,0,0,0,0,0
Correct,0.0011,0.9994,0.834,0,1753,2,1752,1462,0,1753,1753,0,0,1,0,0,0,0,0,0,0,0
Correct,0.1009,0.9704,0.9096,0.8728,1793,181,1740,1631,1565,1793,1793,0,0,0,0,0,1,0,0,1,0,0
Correct,0.2266,0.9858,0,0.778,1761,399,1736,0,1370,1761,1761,0,0,1,0,0,0,0,0,0,0,0
Correct,0.2266,0.9858,0,0.778,1761,399,1736,0,1370,1761,1761,0,0,1,0,0,0,0,0,0,0,0
Correct,0.1745,0.961,0.9145,0.7824,1719,300,1652,1572,1345,1719,1719,0,0,0,0,0,1,0,0,1,0,0
Correct,0.0651,0.994,0.7294,0,1659,108,1649,1210,0,1659,1659,0,0,1,0,0,1,0,0,0,0,0
Correct,0.0923,0.8626,0.0838,0.8573,1885,174,1626,158,1616,1885,1885,0,0,1,0,0,0,0,0,1,0,0
Correct,0.0012,1,0.8942,0.9382,1617,2,1617,1446,1517,1617,1617,0,0,1,0,0,0,0,0,0,0,0
Correct,0.505,0.838,0,0,1883,951,1578,0,0,1883,1883,0,0,0,0,0,0,0,0,0,0,0
Correct,0.1462,0.9284,0.2682,0,1648,241,1530,442,0,1648,1648,0,0,0,0,0,0,0,0,0,0,0
Correct,0.4692,0.6816,0.3682,0.5626,2227,1045,1518,820,1253,2227,2227,0,0,1,0,0,0,0,0,1,0,0
Correct,0.0005,0.7859,0.8432,0,1920,1,1509,1619,0,1920,1920,0,0,0,0,0,1,0,0,0,0,0
Correct,0.0516,0.895,0.0984,0.8986,1667,86,1492,164,1498,1667,1667,0,0,1,0,0,0,0,0,0,0,0
Correct,0.0015,0.9985,0.8917,0.9261,1339,2,1337,1194,1240,1339,1339,0,0,1,0,0,0,0,0,0,0,0
Correct,0.003,0.997,0.9172,0.9216,1340,4,1336,1229,1235,1340,1340,0,0,1,0,0,0,0,0,0,0,0
Correct,0.0004,0.5206,0.9297,0.9439,2476,1,1289,2302,2337,2476,2476,0,0,1,0,0,0,0,0,0,0,0
Correct,0.1144,0.9765,0,0.9015,1320,151,1289,0,1190,1320,1320,0,0,1,0,0,0,0,0,0,0,0
Correct,0.1144,0.9765,0,0.9015,1320,151,1289,0,1190,1320,1320,0,0,1,0,0,0,0,0,0,0,0
Correct,0.5324,0.8678,0,0,1467,781,1273,0,0,1467,1467,0,0,1,0,0,0,0,0,0,0,0
Correct,0.6073,0.9899,0,0,1286,781,1273,0,0,1286,1286,0,0,1,0,0,0,0,0,0,0,0
Correct,0.5433,0.9759,0.8436,0.8128,1202,653,1173,1014,977,1202,1202,0,0,0,0,0,0,0,0,0,0,0
Correct,0.0116,0.8867,0.4761,0.9807,1298,15,1151,618,1273,1298,1298,0,0,1,0,0,0,0,0,0,0,0
Correct,0.0378,0.9974,0.5242,0,1137,43,1134,596,0,1137,1137,0,0,0,0,0,0,0,0,0,0,0
Incorrect,0.8547,0.9622,0,0,1163,994,1119,0,0,1163,1163,0,0,0,0,0,1,0,0,0,0,0
Incorrect,0.8547,0.9622,0.0112,0,1163,994,1119,13,0,1163,1163,0,0,0,0,0,0,0,0,0,0,0
Incorrect,0.7858,0.6486,0,0,1713,1346,1111,0,0,1713,1713,0,0,0,0,0,1,0,0,0,0,0
Correct,0.0012,0.4369,0.4326,0.9711,2529,3,1105,1094,2456,2529,2529,0,0,0,0,0,0,0,0,0,0,0
Correct,0.0009,1,0.5505,0,1090,1,1090,600,0,1090,1090,0,0,0,0,0,1,0,0,0,0,0
Correct,0.0004,0.4239,0.4326,0.9711,2529,1,1072,1094,2456,2529,2529,0,0,0,0,0,0,0,0,0,0,0
Correct,0.0009,0.9103,0.8685,0.9829,1171,1,1066,1017,1151,1171,1171,0,0,1,0,0,0,0,0,0,0,0
Correct,0.0009,1,0.819,0.9274,1061,1,1061,869,984,1061,1061,0,0,1,0,0,0,0,0,0,0,0
Correct,0.0005,0.4729,0.9901,0,2121,1,1003,2100,0,2121,2121,0,0,0,0,0,0,0,0,0,0,0
Incorrect,0.7752,0.7645,0,0,1308,1014,1000,0,0,1308,1308,0,0,1,0,0,0,0,0,0,0,0
Incorrect,0.668,0.6588,0,0,1518,1014,1000,0,0,1518,1518,0,0,1,0,0,0,0,0,0,0,0
Correct,0.605,0.997,0.9518,0,995,602,992,947,0,995,995,0,0,0,0,0,1,0,0,1,0,0
Correct,0.001,1,0,0.9959,970,1,970,0,966,970,970,0,0,0,0,0,0,0,0,0,0,0
