{
  "data_qualities": {
    "quality": [
      {
        "name": "AutoCorrelation",
        "value": "0.7692307692307693"
      },
      {
        "name": "ClassEntropy",
        "value": "1.0"
      },
      {
        "name": "Dimensionality",
        "value": "1.6428571428571428"
      },
      {
        "name": "EquivalentNumberOfAtts",
        "value": []
      },
      {
        "name": "MajorityClassPercentage",
        "value": "50.0"
      },
      {
        "name": "MajorityClassSize",
        "value": "7.0"
      },
      {
        "name": "MaxAttributeEntropy",
        "value": []
      },
      {
        "name": "MaxKurtosisOfNumericAtts",
        "value": "14.0"
      },
      {
        "name": "MaxMeansOfNumericAtts",
        "value": "819.2142857142857"
      },
      {
        "name": "MaxMutualInformation",
        "value": []
      },
      {
        "name": "MaxNominalAttDistinctValues",
        "value": "2.0"
      },
      {
        "name": "MaxSkewnessOfNumericAtts",
        "value": "3.7416573867739413"
      },
      {
        "name": "MaxStdDevOfNumericAtts",
        "value": "1031.4492977583309"
      },
      {
        "name": "MeanAttributeEntropy",
        "value": []
      },
      {
        "name": "MeanKurtosisOfNumericAtts",
        "value": "5.570321568156512"
      },
      {
        "name": "MeanMeansOfNumericAtts",
        "value": "151.48082532467532"
      },
      {
        "name": "MeanMutualInformation",
        "value": []
      },
      {
        "name": "MeanNoiseToSignalRatio",
        "value": []
      },
      {
        "name": "MeanNominalAttDistinctValues",
        "value": "2.0"
      },
      {
        "name": "MeanSkewnessOfNumericAtts",
        "value": "2.154799042640731"
      },
      {
        "name": "MeanStdDevOfNumericAtts",
        "value": "202.20127597862327"
      },
      {
        "name": "MinAttributeEntropy",
        "value": []
      },
      {
        "name": "MinKurtosisOfNumericAtts",
        "value": "-1.03409090909091"
      },
      {
        "name": "MinMeansOfNumericAtts",
        "value": "0.0"
      },
      {
        "name": "MinMutualInformation",
        "value": []
      },
      {
        "name": "MinNominalAttDistinctValues",
        "value": "2.0"
      },
      {
        "name": "MinSkewnessOfNumericAtts",
        "value": "-0.056703261871666875"
      },
      {
        "name": "MinStdDevOfNumericAtts",
        "value": "0.0"
      },
      {
        "name": "MinorityClassPercentage",
        "value": "50.0"
      },
      {
        "name": "MinorityClassSize",
        "value": "7.0"
      },
      {
        "name": "NumberOfBinaryFeatures",
        "value": "1.0"
      },
      {
        "name": "NumberOfClasses",
        "value": "2.0"
      },
      {
        "name": "NumberOfFeatures",
        "value": "23.0"
      },
      {
        "name": "NumberOfInstances",
        "value": "14.0"
      },
      {
        "name": "NumberOfInstancesWithMissingValues",
        "value": "0.0"
      },
      {
        "name": "NumberOfMissingValues",
        "value": "0.0"
      },
      {
        "name": "NumberOfNumericFeatures",
        "value": "22.0"
      },
      {
        "name": "NumberOfSymbolicFeatures",
        "value": "1.0"
      },
      {
        "name": "PercentageOfBinaryFeatures",
        "value": "4.3478260869565215"
      },
      {
        "name": "PercentageOfInstancesWithMissingValues",
        "value": "0.0"
      },
      {
        "name": "PercentageOfMissingValues",
        "value": "0.0"
      },
      {
        "name": "PercentageOfNumericFeatures",
        "value": "95.65217391304348"
      },
      {
        "name": "PercentageOfSymbolicFeatures",
        "value": "4.3478260869565215"
      },
      {
        "name": "Quartile1AttributeEntropy",
        "value": []
      },
      {
        "name": "Quartile1KurtosisOfNumericAtts",
        "value": "-0.3126478804900088"
      },
      {
        "name": "Quartile1MeansOfNumericAtts",
        "value": "0.06621607142857144"
      },
      {
        "name": "Quartile1MutualInformation",
        "value": []
      },
      {
        "name": "Quartile1SkewnessOfNumericAtts",
        "value": "1.066536450385077"
      },
      {
        "name": "Quartile1StdDevOfNumericAtts",
        "value": "0.09072276694961694"
      },
      {
        "name": "Quartile2AttributeEntropy",
        "value": []
      },
      {
        "name": "Quartile2KurtosisOfNumericAtts",
        "value": "3.7098887888231413"
      },
      {
        "name": "Quartile2MeansOfNumericAtts",
        "value": "0.2857142857142857"
      },
      {
        "name": "Quartile2MutualInformation",
        "value": []
      },
      {
        "name": "Quartile2SkewnessOfNumericAtts",
        "value": "2.2211513780612027"
      },
      {
        "name": "Quartile2StdDevOfNumericAtts",
        "value": "0.34653827776937224"
      },
      {
        "name": "Quartile3AttributeEntropy",
        "value": []
      },
      {
        "name": "Quartile3KurtosisOfNumericAtts",
        "value": "10.89048535738521"
      },
      {
        "name": "Quartile3MeansOfNumericAtts",
        "value": "106.53571428571428"
      },
      {
        "name": "Quartile3MutualInformation",
        "value": []
      },
      {
        "name": "Quartile3SkewnessOfNumericAtts",
        "value": "3.2125710375618857"
      },
      {
        "name": "Quartile3StdDevOfNumericAtts",
        "value": "164.09649387765535"
      },
      {
        "name": "StdvNominalAttDistinctValues",
        "value": "0.0"
      }
    ]
  }
}