{
  "data_set_description": {
    "default_target_attribute": "class",
    "description": "cleveland-nominal-pmlb",
    "description_version": "1",
    "file_id": "4965312",
    "format": "ARFF",
    "id": "40711",
    "licence": "public",
    "md5_checksum": "ea550cdd1eaafea748f27975731948a7",
    "minio_url": "https://data.openml.org/datasets/0004/40711/dataset_40711.pq",
    "name": "cleveland-nominal",
    "parquet_url": "https://data.openml.org/datasets/0004/40711/dataset_40711.pq",
    "processing_date": "2018-10-04 07:15:52",
    "status": "active",
    "tag": [
      "Cardiology",
      "Data Analysis",
      "Health",
      "Medicine",
      "study_88"
    ],
    "upload_date": "2017-04-06T12:42:40",
    "url": "https://api.openml.org/data/v1/download/4965312/cleveland-nominal.arff",
    "version": "1",
    "visibility": "public"
  }
}