{
  "data_features": {
    "feature": [
      {
        "data_type": "nominal",
        "index": "0",
        "is_ignore": "false",
        "is_row_identifier": "false",
        "is_target": "false",
        "name": "N0",
        "nominal_value": [
          "0",
          "1"
        ],
        "number_of_missing_values": "0"
      },
      {
        "data_type": "nominal",
        "index": "1",
        "is_ignore": "false",
        "is_row_identifier": "false",
        "is_target": "false",
        "name": "N1",
        "nominal_value": [
          "0",
          "1",
          "2"
        ],
        "number_of_missing_values": "0"
      },
      {
        "data_type": "nominal",
        "index": "2",
        "is_ignore": "false",
        "is_row_identifier": "false",
        "is_target": "false",
        "name": "N2",
        "nominal_value": [
          "0",
          "1",
          "2"
        ],
        "number_of_missing_values": "0"
      },
      {
        "data_type": "nominal",
        "index": "3",
        "is_ignore": "false",
        "is_row_identifier": "false",
        "is_target": "false",
        "name": "N3",
        "nominal_value": [
          "0",
          "1",
          "2"
        ],
        "number_of_missing_values": "0"
      },
      {
        "data_type": "nominal",
        "index": "4",
        "is_ignore": "false",
        "is_row_identifier": "false",
        "is_target": "false",
        "name": "N4",
        "nominal_value": [
          "0",
          "1",
          "2"
        ],
        "number_of_missing_values": "0"
      },
      {
        "data_type": "nominal",
        "index": "5",
        "is_ignore": "false",
        "is_row_identifier": "false",
        "is_target": "false",
        "name": "N5",
        "nominal_value": [
          "0",
          "1",
          "2"
        ],
        "number_of_missing_values": "0"
      },
      {
        "data_type": "nominal",
        "index": "6",
        "is_ignore": "false",
        "is_row_identifier": "false",
        "is_target": "false",
        "name": "N6",
        "nominal_value": [
          "0",
          "1",
          "2"
        ],
        "number_of_missing_values": "0"
      },
      {
        "data_type": "nominal",
        "index": "7",
        "is_ignore": "false",
        "is_row_identifier": "false",
        "is_target": "false",
        "name": "N7",
        "nominal_value": [
          "0",
          "1",
          "2"
        ],
        "number_of_missing_values": "0"
      },
      {
        "data_type": "nominal",
        "index": "8",
        "is_ignore": "false",
        "is_row_identifier": "false",
        "is_target": "false",
        "name": "N8",
        "nominal_value": [
          "0",
          "1",
          "2"
        ],
        "number_of_missing_values": "0"
      },
      {
        "data_type": "nominal",
        "index": "9",
        "is_ignore": "false",
        "is_row_identifier": "false",
        "is_target": "false",
        "name": "N9",
        "nominal_value": [
          "0",
          "1",
          "2"
        ],
        "number_of_missing_values": "0"
      },
      {
        "data_type": "nominal",
        "index": "10",
        "is_ignore": "false",
        "is_row_identifier": "false",
        "is_target": "false",
        "name": "N10",
        "nominal_value": [
          "0",
          "1"
        ],
        "number_of_missing_values": "0"
      },
      {
        "data_type": "nominal",
        "index": "11",
        "is_ignore": "false",
        "is_row_identifier": "false",
        "is_target": "false",
        "name": "N11",
        "nominal_value": [
          "0",
          "1",
          "2"
        ],
        "number_of_missing_values": "0"
      },
      {
        "data_type": "nominal",
        "index": "12",
        "is_ignore": "false",
        "is_row_identifier": "false",
        "is_target": "false",
        "name": "N12",
        "nominal_value": [
          "0",
          "1",
          "2"
        ],
        "number_of_missing_values": "0"
      },
      {
        "data_type": "nominal",
        "index": "13",
        "is_ignore": "false",
        "is_row_identifier": "false",
        "is_target": "false",
        "name": "N13",
        "nominal_value": [
          "0",
          "1",
          "2"
        ],
        "number_of_missing_values": "0"
      },
      {
        "data_type": "nominal",
        "index": "14",
        "is_ignore": "false",
        "is_row_identifier": "false",
        "is_target": "false",
        "name": "N14",
        "nominal_value": [
          "0",
          "1",
          "2"
        ],
        "number_of_missing_values": "0"
      },
      {
        "data_type": "nominal",
        "index": "15",
        "is_ignore": "false",
        "is_row_identifier": "false",
        "is_target": "false",
        "name": "N15",
        "nominal_value": [
          "0",
          "1",
          "2"
        ],
        "number_of_missing_values": "0"
      },
      {
        "data_type": "nominal",
        "index": "16",
        "is_ignore": "false",
        "is_row_identifier": "false",
        "is_target": "false",
        "name": "N16",
        "nominal_value": [
          "0",
          "1",
          "2"
        ],
        "number_of_missing_values": "0"
      },
      {
        "data_type": "nominal",
        "index": "17",
        "is_ignore": "false",
        "is_row_identifier": "false",
        "is_target": "false",
        "name": "N17",
        "nominal_value": [
          "0",
          "1",
          "2"
        ],
        "number_of_missing_values": "0"
      },
      {
        "data_type": "nominal",
        "index": "18",
        "is_ignore": "false",
        "is_row_identifier": "false",
        "is_target": "false",
        "name": "P1",
        "nominal_value": [
          "0",
          "1",
          "2"
        ],
        "number_of_missing_values": "0"
      },
      {
        "data_type": "nominal",
        "index": "19",
        "is_ignore": "false",
        "is_row_identifier": "false",
        "is_target": "false",
        "name": "P2",
        "nominal_value": [
          "0",
          "1",
          "2"
        ],
        "number_of_missing_values": "0"
      },
      {
        "data_type": "nominal",
        "index": "20",
        "is_ignore": "false",
        "is_row_identifier": "false",
        "is_target": "true",
        "name": "class",
        "nominal_value": [
          "0",
          "1"
        ],
        "number_of_missing_values": "0"
      }
    ]
  }
}