{
  "data_features": {
    "feature": [
      {
        "data_type": "nominal",
        "index": "0",
        "is_ignore": "false",
        "is_row_identifier": "false",
        "is_target": "false",
        "name": "cap-shape",
        "nominal_value": [
          "0",
          "1",
          "2",
          "3",
          "4",
          "5"
        ],
        "number_of_missing_values": "0"
      },
      {
        "data_type": "nominal",
        "index": "1",
        "is_ignore": "false",
        "is_row_identifier": "false",
        "is_target": "false",
        "name": "cap-surface",
        "nominal_value": [
          "0",
          "1",
          "2",
          "3"
        ],
        "number_of_missing_values": "0"
      },
      {
        "data_type": "nominal",
        "index": "2",
        "is_ignore": "false",
        "is_row_identifier": "false",
        "is_target": "false",
        "name": "cap-color",
        "nominal_value": [
          "0",
          "1",
          "2",
          "3",
          "4",
          "5",
          "6",
          "7",
          "8",
          "9"
        ],
        "number_of_missing_values": "0"
      },
      {
        "data_type": "nominal",
        "index": "3",
        "is_ignore": "false",
        "is_row_identifier": "false",
        "is_target": "false",
        "name": "bruises?",
        "nominal_value": [
          "0",
          "1"
        ],
        "number_of_missing_values": "0"
      },
      {
        "data_type": "nominal",
        "index": "4",
        "is_ignore": "false",
        "is_row_identifier": "false",
        "is_target": "false",
        "name": "odor",
        "nominal_value": [
          "0",
          "1",
          "2",
          "3",
          "4",
          "5",
          "6",
          "7",
          "8"
        ],
        "number_of_missing_values": "0"
      },
      {
        "data_type": "nominal",
        "index": "5",
        "is_ignore": "false",
        "is_row_identifier": "false",
        "is_target": "false",
        "name": "gill-attachment",
        "nominal_value": [
          "0",
          "1"
        ],
        "number_of_missing_values": "0"
      },
      {
        "data_type": "nominal",
        "index": "6",
        "is_ignore": "false",
        "is_row_identifier": "false",
        "is_target": "false",
        "name": "gill-spacing",
        "nominal_value": [
          "0",
          "1"
        ],
        "number_of_missing_values": "0"
      },
      {
        "data_type": "nominal",
        "index": "7",
        "is_ignore": "false",
        "is_row_identifier": "false",
        "is_target": "false",
        "name": "gill-size",
        "nominal_value": [
          "0",
          "1"
        ],
        "number_of_missing_values": "0"
      },
      {
        "data_type": "numeric",
        "index": "8",
        "is_ignore": "false",
        "is_row_identifier": "false",
        "is_target": "false",
        "name": "gill-color",
        "number_of_missing_values": "0"
      },
      {
        "data_type": "nominal",
        "index": "9",
        "is_ignore": "false",
        "is_row_identifier": "false",
        "is_target": "false",
        "name": "stalk-shape",
        "nominal_value": [
          "0",
          "1"
        ],
        "number_of_missing_values": "0"
      },
      {
        "data_type": "nominal",
        "index": "10",
        "is_ignore": "false",
        "is_row_identifier": "false",
        "is_target": "false",
        "name": "stalk-root",
        "nominal_value": [
          "0",
          "1",
          "2",
          "3",
          "4"
        ],
        "number_of_missing_values": "0"
      },
      {
        "data_type": "nominal",
        "index": "11",
        "is_ignore": "false",
        "is_row_identifier": "false",
        "is_target": "false",
        "name": "stalk-surface-above-ring",
        "nominal_value": [
          "0",
          "1",
          "2",
          "3"
        ],
        "number_of_missing_values": "0"
      },
      {
        "data_type": "nominal",
        "index": "12",
        "is_ignore": "false",
        "is_row_identifier": "false",
        "is_target": "false",
        "name": "stalk-surface-below-ring",
        "nominal_value": [
          "0",
          "1",
          "2",
          "3"
        ],
        "number_of_missing_values": "0"
      },
      {
        "data_type": "nominal",
        "index": "13",
        "is_ignore": "false",
        "is_row_identifier": "false",
        "is_target": "false",
        "name": "stalk-color-above-ring",
        "nominal_value": [
          "0",
          "1",
          "2",
          "3",
          "4",
          "5",
          "6",
          "7",
          "8"
        ],
        "number_of_missing_values": "0"
      },
      {
        "data_type": "nominal",
        "index": "14",
        "is_ignore": "false",
        "is_row_identifier": "false",
        "is_target": "false",
        "name": "stalk-color-below-ring",
        "nominal_value": [
          "0",
          "1",
          "2",
          "3",
          "4",
          "5",
          "6",
          "7",
          "8"
        ],
        "number_of_missing_values": "0"
      },
      {
        "data_type": "nominal",
        "index": "15",
        "is_ignore": "false",
        "is_row_identifier": "false",
        "is_target": "false",
        "name": "veil-type",
        "nominal_value": "0",
        "number_of_missing_values": "0"
      },
      {
        "data_type": "nominal",
        "index": "16",
        "is_ignore": "false",
        "is_row_identifier": "false",
        "is_target": "false",
        "name": "veil-color",
        "nominal_value": [
          "0",
          "1",
          "2",
          "3"
        ],
        "number_of_missing_values": "0"
      },
      {
        "data_type": "nominal",
        "index": "17",
        "is_ignore": "false",
        "is_row_identifier": "false",
        "is_target": "false",
        "name": "ring-number",
        "nominal_value": [
          "0",
          "1",
          "2"
        ],
        "number_of_missing_values": "0"
      },
      {
        "data_type": "nominal",
        "index": "18",
        "is_ignore": "false",
        "is_row_identifier": "false",
        "is_target": "false",
        "name": "ring-type",
        "nominal_value": [
          "0",
          "1",
          "2",
          "3",
          "4"
        ],
        "number_of_missing_values": "0"
      },
      {
        "data_type": "nominal",
        "index": "19",
        "is_ignore": "false",
        "is_row_identifier": "false",
        "is_target": "false",
        "name": "spore-print-color",
        "nominal_value": [
          "0",
          "1",
          "2",
          "3",
          "4",
          "5",
          "6",
          "7",
          "8"
        ],
        "number_of_missing_values": "0"
      },
      {
        "data_type": "nominal",
        "index": "20",
        "is_ignore": "false",
        "is_row_identifier": "false",
        "is_target": "false",
        "name": "population",
        "nominal_value": [
          "0",
          "1",
          "2",
          "3",
          "4",
          "5"
        ],
        "number_of_missing_values": "0"
      },
      {
        "data_type": "nominal",
        "index": "21",
        "is_ignore": "false",
        "is_row_identifier": "false",
        "is_target": "false",
        "name": "habitat",
        "nominal_value": [
          "0",
          "1",
          "2",
          "3",
          "4",
          "5",
          "6"
        ],
        "number_of_missing_values": "0"
      },
      {
        "data_type": "nominal",
        "index": "22",
        "is_ignore": "false",
        "is_row_identifier": "false",
        "is_target": "true",
        "name": "class",
        "nominal_value": [
          "0",
          "1"
        ],
        "number_of_missing_values": "0"
      }
    ]
  }
}