{
  "data_set_description": {
    "default_target_attribute": "class",
    "description": "GAMETES_Heterogeneity_20atts_1600_Het_0.4_0.2_50_EDM-2_001-pmlb",
    "description_version": "1",
    "file_id": "4965228",
    "format": "ARFF",
    "id": "40655",
    "licence": "public",
    "md5_checksum": "05384ae8ae7fafc905aaf45b8f5aaeae",
    "minio_url": "https://data.openml.org/datasets/0004/40655/dataset_40655.pq",
    "name": "GAMETES_Heterogeneity_20atts_1600_Het_0.4_0.2_50_EDM-2_001",
    "parquet_url": "https://data.openml.org/datasets/0004/40655/dataset_40655.pq",
    "processing_date": "2018-10-04 07:11:27",
    "status": "deactivated",
    "tag": "artificial",
    "upload_date": "2017-04-06T12:12:08",
    "url": "https://api.openml.org/data/v1/download/4965228/GAMETES_Heterogeneity_20atts_1600_Het_0.4_0.2_50_EDM-2_001.arff",
    "version": "2",
    "visibility": "public"
  }
}