{
  "data_qualities": {
    "quality": [
      {
        "name": "AutoCorrelation",
        "value": "0.9993746091307066"
      },
      {
        "name": "ClassEntropy",
        "value": "1.0"
      },
      {
        "name": "Dimensionality",
        "value": "0.013125"
      },
      {
        "name": "EquivalentNumberOfAtts",
        "value": "1439.3751082967085"
      },
      {
        "name": "MajorityClassPercentage",
        "value": "50.0"
      },
      {
        "name": "MajorityClassSize",
        "value": "800.0"
      },
      {
        "name": "MaxAttributeEntropy",
        "value": "1.4864845101685833"
      },
      {
        "name": "MaxKurtosisOfNumericAtts",
        "value": []
      },
      {
        "name": "MaxMeansOfNumericAtts",
        "value": []
      },
      {
        "name": "MaxMutualInformation",
        "value": "0.00261303309797"
      },
      {
        "name": "MaxNominalAttDistinctValues",
        "value": "3.0"
      },
      {
        "name": "MaxSkewnessOfNumericAtts",
        "value": []
      },
      {
        "name": "MaxStdDevOfNumericAtts",
        "value": []
      },
      {
        "name": "MeanAttributeEntropy",
        "value": "1.0391735708061407"
      },
      {
        "name": "MeanKurtosisOfNumericAtts",
        "value": []
      },
      {
        "name": "MeanMeansOfNumericAtts",
        "value": []
      },
      {
        "name": "MeanMutualInformation",
        "value": "6.94745931228E-4"
      },
      {
        "name": "MeanNoiseToSignalRatio",
        "value": "1494.7605710181658"
      },
      {
        "name": "MeanNominalAttDistinctValues",
        "value": "2.9047619047619047"
      },
      {
        "name": "MeanSkewnessOfNumericAtts",
        "value": []
      },
      {
        "name": "MeanStdDevOfNumericAtts",
        "value": []
      },
      {
        "name": "MinAttributeEntropy",
        "value": "0.15184252131138493"
      },
      {
        "name": "MinKurtosisOfNumericAtts",
        "value": []
      },
      {
        "name": "MinMeansOfNumericAtts",
        "value": []
      },
      {
        "name": "MinMutualInformation",
        "value": "4.695023318E-5"
      },
      {
        "name": "MinNominalAttDistinctValues",
        "value": "2.0"
      },
      {
        "name": "MinSkewnessOfNumericAtts",
        "value": []
      },
      {
        "name": "MinStdDevOfNumericAtts",
        "value": []
      },
      {
        "name": "MinorityClassPercentage",
        "value": "50.0"
      },
      {
        "name": "MinorityClassSize",
        "value": "800.0"
      },
      {
        "name": "NumberOfBinaryFeatures",
        "value": "2.0"
      },
      {
        "name": "NumberOfClasses",
        "value": "2.0"
      },
      {
        "name": "NumberOfFeatures",
        "value": "21.0"
      },
      {
        "name": "NumberOfInstances",
        "value": "1600.0"
      },
      {
        "name": "NumberOfInstancesWithMissingValues",
        "value": "0.0"
      },
      {
        "name": "NumberOfMissingValues",
        "value": "0.0"
      },
      {
        "name": "NumberOfNumericFeatures",
        "value": "0.0"
      },
      {
        "name": "NumberOfSymbolicFeatures",
        "value": "21.0"
      },
      {
        "name": "PercentageOfBinaryFeatures",
        "value": "9.523809523809524"
      },
      {
        "name": "PercentageOfInstancesWithMissingValues",
        "value": "0.0"
      },
      {
        "name": "PercentageOfMissingValues",
        "value": "0.0"
      },
      {
        "name": "PercentageOfNumericFeatures",
        "value": "0.0"
      },
      {
        "name": "PercentageOfSymbolicFeatures",
        "value": "100.0"
      },
      {
        "name": "Quartile1AttributeEntropy",
        "value": "0.7517150933634806"
      },
      {
        "name": "Quartile1KurtosisOfNumericAtts",
        "value": []
      },
      {
        "name": "Quartile1MeansOfNumericAtts",
        "value": []
      },
      {
        "name": "Quartile1MutualInformation",
        "value": "1.545969588775E-4"
      },
      {
        "name": "Quartile1SkewnessOfNumericAtts",
        "value": []
      },
      {
        "name": "Quartile1StdDevOfNumericAtts",
        "value": []
      },
      {
        "name": "Quartile2AttributeEntropy",
        "value": "1.1272406846001624"
      },
      {
        "name": "Quartile2KurtosisOfNumericAtts",
        "value": []
      },
      {
        "name": "Quartile2MeansOfNumericAtts",
        "value": []
      },
      {
        "name": "Quartile2MutualInformation",
        "value": "3.6615824294E-4"
      },
      {
        "name": "Quartile2SkewnessOfNumericAtts",
        "value": []
      },
      {
        "name": "Quartile2StdDevOfNumericAtts",
        "value": []
      },
      {
        "name": "Quartile3AttributeEntropy",
        "value": "1.3324910631960198"
      },
      {
        "name": "Quartile3KurtosisOfNumericAtts",
        "value": []
      },
      {
        "name": "Quartile3MeansOfNumericAtts",
        "value": []
      },
      {
        "name": "Quartile3MutualInformation",
        "value": "0.001087876100855"
      },
      {
        "name": "Quartile3SkewnessOfNumericAtts",
        "value": []
      },
      {
        "name": "Quartile3StdDevOfNumericAtts",
        "value": []
      },
      {
        "name": "StdvNominalAttDistinctValues",
        "value": "0.3007926037591192"
      }
    ]
  }
}