{
  "data_qualities": {
    "quality": [
      {
        "name": "AutoCorrelation",
        "value": "0.5189445196211097"
      },
      {
        "name": "ClassEntropy",
        "value": "2.466201302439522"
      },
      {
        "name": "Dimensionality",
        "value": "0.006085192697768763"
      },
      {
        "name": "EquivalentNumberOfAtts",
        "value": []
      },
      {
        "name": "MajorityClassPercentage",
        "value": "31.304935767410413"
      },
      {
        "name": "MajorityClassSize",
        "value": "463.0"
      },
      {
        "name": "MaxAttributeEntropy",
        "value": []
      },
      {
        "name": "MaxKurtosisOfNumericAtts",
        "value": "159.883510648585"
      },
      {
        "name": "MaxMeansOfNumericAtts",
        "value": "0.5030425963488844"
      },
      {
        "name": "MaxMutualInformation",
        "value": []
      },
      {
        "name": "MaxNominalAttDistinctValues",
        "value": "9.0"
      },
      {
        "name": "MaxSkewnessOfNumericAtts",
        "value": "12.714845944724198"
      },
      {
        "name": "MaxStdDevOfNumericAtts",
        "value": "0.13721646217576555"
      },
      {
        "name": "MeanAttributeEntropy",
        "value": []
      },
      {
        "name": "MeanKurtosisOfNumericAtts",
        "value": "35.9288486967035"
      },
      {
        "name": "MeanMeansOfNumericAtts",
        "value": "0.3807217714672076"
      },
      {
        "name": "MeanMutualInformation",
        "value": []
      },
      {
        "name": "MeanNoiseToSignalRatio",
        "value": []
      },
      {
        "name": "MeanNominalAttDistinctValues",
        "value": "9.0"
      },
      {
        "name": "MeanSkewnessOfNumericAtts",
        "value": "3.2276078087178193"
      },
      {
        "name": "MeanStdDevOfNumericAtts",
        "value": "0.0953007256327662"
      },
      {
        "name": "MinAttributeEntropy",
        "value": []
      },
      {
        "name": "MinKurtosisOfNumericAtts",
        "value": "0.4892319696122822"
      },
      {
        "name": "MinMeansOfNumericAtts",
        "value": "0.00752535496957407"
      },
      {
        "name": "MinMutualInformation",
        "value": []
      },
      {
        "name": "MinNominalAttDistinctValues",
        "value": "9.0"
      },
      {
        "name": "MinSkewnessOfNumericAtts",
        "value": "-1.7899178324894864"
      },
      {
        "name": "MinStdDevOfNumericAtts",
        "value": "0.038898120951430866"
      },
      {
        "name": "MinorityClassPercentage",
        "value": "1.352265043948614"
      },
      {
        "name": "MinorityClassSize",
        "value": "20.0"
      },
      {
        "name": "NumberOfBinaryFeatures",
        "value": "0.0"
      },
      {
        "name": "NumberOfClasses",
        "value": "9.0"
      },
      {
        "name": "NumberOfFeatures",
        "value": "9.0"
      },
      {
        "name": "NumberOfInstances",
        "value": "1479.0"
      },
      {
        "name": "NumberOfInstancesWithMissingValues",
        "value": "0.0"
      },
      {
        "name": "NumberOfMissingValues",
        "value": "0.0"
      },
      {
        "name": "NumberOfNumericFeatures",
        "value": "8.0"
      },
      {
        "name": "NumberOfSymbolicFeatures",
        "value": "1.0"
      },
      {
        "name": "PercentageOfBinaryFeatures",
        "value": "0.0"
      },
      {
        "name": "PercentageOfInstancesWithMissingValues",
        "value": "0.0"
      },
      {
        "name": "PercentageOfMissingValues",
        "value": "0.0"
      },
      {
        "name": "PercentageOfNumericFeatures",
        "value": "88.88888888888889"
      },
      {
        "name": "PercentageOfSymbolicFeatures",
        "value": "11.11111111111111"
      },
      {
        "name": "Quartile1AttributeEntropy",
        "value": []
      },
      {
        "name": "Quartile1KurtosisOfNumericAtts",
        "value": "0.8022579651136778"
      },
      {
        "name": "Quartile1MeansOfNumericAtts",
        "value": "0.2647751859364435"
      },
      {
        "name": "Quartile1MutualInformation",
        "value": []
      },
      {
        "name": "Quartile1SkewnessOfNumericAtts",
        "value": "-0.06577773100949841"
      },
      {
        "name": "Quartile1StdDevOfNumericAtts",
        "value": "0.06231869987039746"
      },
      {
        "name": "Quartile2AttributeEntropy",
        "value": []
      },
      {
        "name": "Quartile2KurtosisOfNumericAtts",
        "value": "5.023231128280454"
      },
      {
        "name": "Quartile2MeansOfNumericAtts",
        "value": "0.4990736984448952"
      },
      {
        "name": "Quartile2MutualInformation",
        "value": []
      },
      {
        "name": "Quartile2SkewnessOfNumericAtts",
        "value": "1.0262804386700506"
      },
      {
        "name": "Quartile2StdDevOfNumericAtts",
        "value": "0.09665518671885837"
      },
      {
        "name": "Quartile3AttributeEntropy",
        "value": []
      },
      {
        "name": "Quartile3KurtosisOfNumericAtts",
        "value": "81.40007602600993"
      },
      {
        "name": "Quartile3MeansOfNumericAtts",
        "value": "0.5000033806626099"
      },
      {
        "name": "Quartile3MutualInformation",
        "value": []
      },
      {
        "name": "Quartile3SkewnessOfNumericAtts",
        "value": "8.296565073547601"
      },
      {
        "name": "Quartile3StdDevOfNumericAtts",
        "value": "0.13305424177833386"
      },
      {
        "name": "StdvNominalAttDistinctValues",
        "value": "0.0"
      }
    ]
  }
}