{
  "data_qualities": {
    "quality": [
      {
        "name": "AutoCorrelation",
        "value": []
      },
      {
        "name": "ClassEntropy",
        "value": []
      },
      {
        "name": "Dimensionality",
        "value": "0.0017229805325576191"
      },
      {
        "name": "EquivalentNumberOfAtts",
        "value": []
      },
      {
        "name": "MajorityClassPercentage",
        "value": []
      },
      {
        "name": "MajorityClassSize",
        "value": []
      },
      {
        "name": "MaxAttributeEntropy",
        "value": []
      },
      {
        "name": "MaxKurtosisOfNumericAtts",
        "value": "7444.166410162919"
      },
      {
        "name": "MaxMeansOfNumericAtts",
        "value": "21074.281308301157"
      },
      {
        "name": "MaxMutualInformation",
        "value": []
      },
      {
        "name": "MaxNominalAttDistinctValues",
        "value": "5.0"
      },
      {
        "name": "MaxSkewnessOfNumericAtts",
        "value": "86.28924178004843"
      },
      {
        "name": "MaxStdDevOfNumericAtts",
        "value": "147157.1781717772"
      },
      {
        "name": "MeanAttributeEntropy",
        "value": []
      },
      {
        "name": "MeanKurtosisOfNumericAtts",
        "value": "259.0922955743747"
      },
      {
        "name": "MeanMeansOfNumericAtts",
        "value": "325.7197482952857"
      },
      {
        "name": "MeanMutualInformation",
        "value": []
      },
      {
        "name": "MeanNoiseToSignalRatio",
        "value": []
      },
      {
        "name": "MeanNominalAttDistinctValues",
        "value": "2.5"
      },
      {
        "name": "MeanSkewnessOfNumericAtts",
        "value": "4.677123590138484"
      },
      {
        "name": "MeanStdDevOfNumericAtts",
        "value": "2402.1981838138904"
      },
      {
        "name": "MinAttributeEntropy",
        "value": []
      },
      {
        "name": "MinKurtosisOfNumericAtts",
        "value": "-1.937830288936087"
      },
      {
        "name": "MinMeansOfNumericAtts",
        "value": "0.06302006660753373"
      },
      {
        "name": "MinMutualInformation",
        "value": []
      },
      {
        "name": "MinNominalAttDistinctValues",
        "value": "2.0"
      },
      {
        "name": "MinSkewnessOfNumericAtts",
        "value": "0.03198464465814965"
      },
      {
        "name": "MinStdDevOfNumericAtts",
        "value": "0.16156422789603403"
      },
      {
        "name": "MinorityClassPercentage",
        "value": []
      },
      {
        "name": "MinorityClassSize",
        "value": []
      },
      {
        "name": "NumberOfBinaryFeatures",
        "value": "5.0"
      },
      {
        "name": "NumberOfClasses",
        "value": []
      },
      {
        "name": "NumberOfFeatures",
        "value": "77.0"
      },
      {
        "name": "NumberOfInstances",
        "value": "44690.0"
      },
      {
        "name": "NumberOfInstancesWithMissingValues",
        "value": "0.0"
      },
      {
        "name": "NumberOfMissingValues",
        "value": "0.0"
      },
      {
        "name": "NumberOfNumericFeatures",
        "value": "67.0"
      },
      {
        "name": "NumberOfSymbolicFeatures",
        "value": "6.0"
      },
      {
        "name": "PercentageOfBinaryFeatures",
        "value": "6.493506493506493"
      },
      {
        "name": "PercentageOfInstancesWithMissingValues",
        "value": "0.0"
      },
      {
        "name": "PercentageOfMissingValues",
        "value": "0.0"
      },
      {
        "name": "PercentageOfNumericFeatures",
        "value": "87.01298701298701"
      },
      {
        "name": "PercentageOfSymbolicFeatures",
        "value": "7.792207792207792"
      },
      {
        "name": "Quartile1AttributeEntropy",
        "value": []
      },
      {
        "name": "Quartile1KurtosisOfNumericAtts",
        "value": "-0.7891956102452786"
      },
      {
        "name": "Quartile1MeansOfNumericAtts",
        "value": "0.15873161037193198"
      },
      {
        "name": "Quartile1MutualInformation",
        "value": []
      },
      {
        "name": "Quartile1SkewnessOfNumericAtts",
        "value": "0.47803601030299436"
      },
      {
        "name": "Quartile1StdDevOfNumericAtts",
        "value": "0.2505107900238823"
      },
      {
        "name": "Quartile2AttributeEntropy",
        "value": []
      },
      {
        "name": "Quartile2KurtosisOfNumericAtts",
        "value": "-0.09697708969270247"
      },
      {
        "name": "Quartile2MeansOfNumericAtts",
        "value": "0.3331653740590348"
      },
      {
        "name": "Quartile2MutualInformation",
        "value": []
      },
      {
        "name": "Quartile2SkewnessOfNumericAtts",
        "value": "0.8289589902055221"
      },
      {
        "name": "Quartile2StdDevOfNumericAtts",
        "value": "0.2864905492062518"
      },
      {
        "name": "Quartile3AttributeEntropy",
        "value": []
      },
      {
        "name": "Quartile3KurtosisOfNumericAtts",
        "value": "3.938136999655931"
      },
      {
        "name": "Quartile3MeansOfNumericAtts",
        "value": "0.39407066481550007"
      },
      {
        "name": "Quartile3MutualInformation",
        "value": []
      },
      {
        "name": "Quartile3SkewnessOfNumericAtts",
        "value": "2.131291734370947"
      },
      {
        "name": "Quartile3StdDevOfNumericAtts",
        "value": "0.3264409297463903"
      },
      {
        "name": "StdvNominalAttDistinctValues",
        "value": "1.224744871391589"
      }
    ]
  }
}