{
  "data_qualities": {
    "quality": [
      {
        "name": "AutoCorrelation",
        "value": "0.9753255654557916"
      },
      {
        "name": "ClassEntropy",
        "value": []
      },
      {
        "name": "Dimensionality",
        "value": "0.739041095890411"
      },
      {
        "name": "EquivalentNumberOfAtts",
        "value": []
      },
      {
        "name": "MajorityClassPercentage",
        "value": "98.6986301369863"
      },
      {
        "name": "MajorityClassSize",
        "value": "1441.0"
      },
      {
        "name": "MaxAttributeEntropy",
        "value": []
      },
      {
        "name": "MaxKurtosisOfNumericAtts",
        "value": "117.07963409465621"
      },
      {
        "name": "MaxMeansOfNumericAtts",
        "value": "1.0"
      },
      {
        "name": "MaxMutualInformation",
        "value": []
      },
      {
        "name": "MaxNominalAttDistinctValues",
        "value": "2.0"
      },
      {
        "name": "MaxSkewnessOfNumericAtts",
        "value": "10.90501044297922"
      },
      {
        "name": "MaxStdDevOfNumericAtts",
        "value": "0.5001670972439974"
      },
      {
        "name": "MeanAttributeEntropy",
        "value": []
      },
      {
        "name": "MeanKurtosisOfNumericAtts",
        "value": "3.5601988950856596"
      },
      {
        "name": "MeanMeansOfNumericAtts",
        "value": "0.1862290563772308"
      },
      {
        "name": "MeanMutualInformation",
        "value": []
      },
      {
        "name": "MeanNoiseToSignalRatio",
        "value": []
      },
      {
        "name": "MeanNominalAttDistinctValues",
        "value": "2.0"
      },
      {
        "name": "MeanSkewnessOfNumericAtts",
        "value": "2.006427111497244"
      },
      {
        "name": "MeanStdDevOfNumericAtts",
        "value": "0.3471162103026097"
      },
      {
        "name": "MinAttributeEntropy",
        "value": []
      },
      {
        "name": "MinKurtosisOfNumericAtts",
        "value": "-2.002677579235537"
      },
      {
        "name": "MinMeansOfNumericAtts",
        "value": "0.00821917808219176"
      },
      {
        "name": "MinMutualInformation",
        "value": []
      },
      {
        "name": "MinNominalAttDistinctValues",
        "value": "2.0"
      },
      {
        "name": "MinSkewnessOfNumericAtts",
        "value": "-6.766217272135317"
      },
      {
        "name": "MinStdDevOfNumericAtts",
        "value": "0.0"
      },
      {
        "name": "MinorityClassPercentage",
        "value": "1.3013698630136987"
      },
      {
        "name": "MinorityClassSize",
        "value": "19.0"
      },
      {
        "name": "NumberOfBinaryFeatures",
        "value": "75.0"
      },
      {
        "name": "NumberOfClasses",
        "value": "2.0"
      },
      {
        "name": "NumberOfFeatures",
        "value": "1079.0"
      },
      {
        "name": "NumberOfInstances",
        "value": "1460.0"
      },
      {
        "name": "NumberOfInstancesWithMissingValues",
        "value": "0.0"
      },
      {
        "name": "NumberOfMissingValues",
        "value": "0.0"
      },
      {
        "name": "NumberOfNumericFeatures",
        "value": "1004.0"
      },
      {
        "name": "NumberOfSymbolicFeatures",
        "value": "75.0"
      },
      {
        "name": "PercentageOfBinaryFeatures",
        "value": "6.950880444856349"
      },
      {
        "name": "PercentageOfInstancesWithMissingValues",
        "value": "0.0"
      },
      {
        "name": "PercentageOfMissingValues",
        "value": "0.0"
      },
      {
        "name": "PercentageOfNumericFeatures",
        "value": "93.04911955514366"
      },
      {
        "name": "PercentageOfSymbolicFeatures",
        "value": "6.950880444856349"
      },
      {
        "name": "Quartile1AttributeEntropy",
        "value": []
      },
      {
        "name": "Quartile1KurtosisOfNumericAtts",
        "value": "0.7778147272521736"
      },
      {
        "name": "Quartile1MeansOfNumericAtts",
        "value": "0.10291095890410948"
      },
      {
        "name": "Quartile1MutualInformation",
        "value": []
      },
      {
        "name": "Quartile1SkewnessOfNumericAtts",
        "value": "1.646871109574757"
      },
      {
        "name": "Quartile1StdDevOfNumericAtts",
        "value": "0.30010279253342986"
      },
      {
        "name": "Quartile2AttributeEntropy",
        "value": []
      },
      {
        "name": "Quartile2KurtosisOfNumericAtts",
        "value": "2.196988452567541"
      },
      {
        "name": "Quartile2MeansOfNumericAtts",
        "value": "0.14315068493150696"
      },
      {
        "name": "Quartile2MutualInformation",
        "value": []
      },
      {
        "name": "Quartile2SkewnessOfNumericAtts",
        "value": "2.0399168763554902"
      },
      {
        "name": "Quartile2StdDevOfNumericAtts",
        "value": "0.34964696117021765"
      },
      {
        "name": "Quartile3AttributeEntropy",
        "value": []
      },
      {
        "name": "Quartile3KurtosisOfNumericAtts",
        "value": "5.065367437514267"
      },
      {
        "name": "Quartile3MeansOfNumericAtts",
        "value": "0.1835616438356164"
      },
      {
        "name": "Quartile3MutualInformation",
        "value": []
      },
      {
        "name": "Quartile3SkewnessOfNumericAtts",
        "value": "2.619529307476992"
      },
      {
        "name": "Quartile3StdDevOfNumericAtts",
        "value": "0.38328848436840873"
      },
      {
        "name": "StdvNominalAttDistinctValues",
        "value": "0.0"
      }
    ]
  }
}