{
  "data_qualities": {
    "quality": [
      {
        "name": "AutoCorrelation",
        "value": "0.992496248124062"
      },
      {
        "name": "ClassEntropy",
        "value": []
      },
      {
        "name": "Dimensionality",
        "value": "0.07"
      },
      {
        "name": "EquivalentNumberOfAtts",
        "value": []
      },
      {
        "name": "MajorityClassPercentage",
        "value": "79.55"
      },
      {
        "name": "MajorityClassSize",
        "value": "1591.0"
      },
      {
        "name": "MaxAttributeEntropy",
        "value": []
      },
      {
        "name": "MaxKurtosisOfNumericAtts",
        "value": "5.3187985855435125"
      },
      {
        "name": "MaxMeansOfNumericAtts",
        "value": "130.19975000000014"
      },
      {
        "name": "MaxMutualInformation",
        "value": []
      },
      {
        "name": "MaxNominalAttDistinctValues",
        "value": "2.0"
      },
      {
        "name": "MaxSkewnessOfNumericAtts",
        "value": "0.6431466829036582"
      },
      {
        "name": "MaxStdDevOfNumericAtts",
        "value": "64.24365012026296"
      },
      {
        "name": "MeanAttributeEntropy",
        "value": []
      },
      {
        "name": "MeanKurtosisOfNumericAtts",
        "value": "1.1102801488461196"
      },
      {
        "name": "MeanMeansOfNumericAtts",
        "value": "19.07903518518517"
      },
      {
        "name": "MeanMutualInformation",
        "value": []
      },
      {
        "name": "MeanNoiseToSignalRatio",
        "value": []
      },
      {
        "name": "MeanNominalAttDistinctValues",
        "value": "2.0"
      },
      {
        "name": "MeanSkewnessOfNumericAtts",
        "value": "0.04609390247529555"
      },
      {
        "name": "MeanStdDevOfNumericAtts",
        "value": "46.09285322526124"
      },
      {
        "name": "MinAttributeEntropy",
        "value": []
      },
      {
        "name": "MinKurtosisOfNumericAtts",
        "value": "-1.1349165679021187"
      },
      {
        "name": "MinMeansOfNumericAtts",
        "value": "-30.86324999999981"
      },
      {
        "name": "MinMutualInformation",
        "value": []
      },
      {
        "name": "MinNominalAttDistinctValues",
        "value": "2.0"
      },
      {
        "name": "MinSkewnessOfNumericAtts",
        "value": "-0.5414377644688596"
      },
      {
        "name": "MinStdDevOfNumericAtts",
        "value": "28.58984374199992"
      },
      {
        "name": "MinorityClassPercentage",
        "value": "20.45"
      },
      {
        "name": "MinorityClassSize",
        "value": "409.0"
      },
      {
        "name": "NumberOfBinaryFeatures",
        "value": "5.0"
      },
      {
        "name": "NumberOfClasses",
        "value": "2.0"
      },
      {
        "name": "NumberOfFeatures",
        "value": "140.0"
      },
      {
        "name": "NumberOfInstances",
        "value": "2000.0"
      },
      {
        "name": "NumberOfInstancesWithMissingValues",
        "value": "0.0"
      },
      {
        "name": "NumberOfMissingValues",
        "value": "0.0"
      },
      {
        "name": "NumberOfNumericFeatures",
        "value": "135.0"
      },
      {
        "name": "NumberOfSymbolicFeatures",
        "value": "5.0"
      },
      {
        "name": "PercentageOfBinaryFeatures",
        "value": "3.571428571428571"
      },
      {
        "name": "PercentageOfInstancesWithMissingValues",
        "value": "0.0"
      },
      {
        "name": "PercentageOfMissingValues",
        "value": "0.0"
      },
      {
        "name": "PercentageOfNumericFeatures",
        "value": "96.42857142857143"
      },
      {
        "name": "PercentageOfSymbolicFeatures",
        "value": "3.571428571428571"
      },
      {
        "name": "Quartile1AttributeEntropy",
        "value": []
      },
      {
        "name": "Quartile1KurtosisOfNumericAtts",
        "value": "0.08435328117370133"
      },
      {
        "name": "Quartile1MeansOfNumericAtts",
        "value": "-14.706125000000005"
      },
      {
        "name": "Quartile1MutualInformation",
        "value": []
      },
      {
        "name": "Quartile1SkewnessOfNumericAtts",
        "value": "-0.0886841392270958"
      },
      {
        "name": "Quartile1StdDevOfNumericAtts",
        "value": "36.8845248896901"
      },
      {
        "name": "Quartile2AttributeEntropy",
        "value": []
      },
      {
        "name": "Quartile2KurtosisOfNumericAtts",
        "value": "0.914800888312215"
      },
      {
        "name": "Quartile2MeansOfNumericAtts",
        "value": "-1.397374999999992"
      },
      {
        "name": "Quartile2MutualInformation",
        "value": []
      },
      {
        "name": "Quartile2SkewnessOfNumericAtts",
        "value": "0.029000222230037186"
      },
      {
        "name": "Quartile2StdDevOfNumericAtts",
        "value": "46.85926040151579"
      },
      {
        "name": "Quartile3AttributeEntropy",
        "value": []
      },
      {
        "name": "Quartile3KurtosisOfNumericAtts",
        "value": "2.024486391548705"
      },
      {
        "name": "Quartile3MeansOfNumericAtts",
        "value": "24.743999999999993"
      },
      {
        "name": "Quartile3MutualInformation",
        "value": []
      },
      {
        "name": "Quartile3SkewnessOfNumericAtts",
        "value": "0.17191009900562382"
      },
      {
        "name": "Quartile3StdDevOfNumericAtts",
        "value": "54.28711972117616"
      },
      {
        "name": "StdvNominalAttDistinctValues",
        "value": "0.0"
      }
    ]
  }
}