{
  "data_features": {
    "feature": [
      {
        "data_type": "nominal",
        "index": "0",
        "is_ignore": "false",
        "is_row_identifier": "true",
        "is_target": "false",
        "name": "molecule_id",
        "nominal_value": [
          "CHEMBL10",
          "CHEMBL101253",
          "CHEMBL101311",
          "CHEMBL103667",
          "CHEMBL105442",
          "CHEMBL1081312",
          "CHEMBL1084546",
          "CHEMBL1164180",
          "CHEMBL1173655",
          "CHEMBL119385",
          "CHEMBL1230020",
          "CHEMBL1233887",
          "CHEMBL1236107",
          "CHEMBL1240703",
          "CHEMBL1241674",
          "CHEMBL124660",
          "CHEMBL1287853",
          "CHEMBL1289926",
          "CHEMBL1336",
          "CHEMBL1421",
          "CHEMBL1421720",
          "CHEMBL14762",
          "CHEMBL1614701",
          "CHEMBL162",
          "CHEMBL1651523",
          "CHEMBL1721885",
          "CHEMBL1789941",
          "CHEMBL180022",
          "CHEMBL1825138",
          "CHEMBL1870106",
          "CHEMBL1879463",
          "CHEMBL189963",
          "CHEMBL1908391",
          "CHEMBL1908392",
          "CHEMBL1908393",
          "CHEMBL1908394",
          "CHEMBL1908395",
          "CHEMBL1908396",
          "CHEMBL1908397",
          "CHEMBL191003",
          "CHEMBL1949855",
          "CHEMBL1964382",
          "CHEMBL1964441",
          "CHEMBL1964902",
          "CHEMBL1964948",
          "CHEMBL1965033",
          "CHEMBL1965169",
          "CHEMBL1965170",
          "CHEMBL1965387",
          "CHEMBL1965660",
          "CHEMBL1965789",
          "CHEMBL1966175",
          "CHEMBL1967252",
          "CHEMBL1967336",
          "CHEMBL1967513",
          "CHEMBL1967878",
          "CHEMBL1967992",
          "CHEMBL1967998",
          "CHEMBL1968705",
          "CHEMBL1968868",
          "CHEMBL1969151",
          "CHEMBL1969156",
          "CHEMBL1969664",
          "CHEMBL1969942",
          "CHEMBL1970290",
          "CHEMBL1970340",
          "CHEMBL1970352",
          "CHEMBL1971227",
          "CHEMBL1971289",
          "CHEMBL1971519",
          "CHEMBL1971606",
          "CHEMBL1971943",
          "CHEMBL1972220",
          "CHEMBL1972355",
          "CHEMBL1972462",
          "CHEMBL1972934",
          "CHEMBL1973013",
          "CHEMBL1973016",
          "CHEMBL1973138",
          "CHEMBL1973359",
          "CHEMBL1973363",
          "CHEMBL1973516",
          "CHEMBL1973720",
          "CHEMBL1973793",
          "CHEMBL1973868",
          "CHEMBL1973961",
          "CHEMBL1974328",
          "CHEMBL1974480",
          "CHEMBL1974574",
          "CHEMBL1974617",
          "CHEMBL1974998",
          "CHEMBL1975121",
          "CHEMBL1975212",
          "CHEMBL1975903",
          "CHEMBL1975921",
          "CHEMBL1975923",
          "CHEMBL1975927",
          "CHEMBL1976040",
          "CHEMBL1976196",
          "CHEMBL1976376",
          "CHEMBL1976420",
          "CHEMBL1977134",
          "CHEMBL1977138",
          "CHEMBL1977634",
          "CHEMBL1977749",
          "CHEMBL1977814",
          "CHEMBL1978166",
          "CHEMBL1978167",
          "CHEMBL1978195",
          "CHEMBL1978271",
          "CHEMBL1978371",
          "CHEMBL1978448",
          "CHEMBL1978562",
          "CHEMBL1978567",
          "CHEMBL1979690",
          "CHEMBL1979773",
          "CHEMBL1980167",
          "CHEMBL1980246",
          "CHEMBL1980297",
          "CHEMBL1980329",
          "CHEMBL1980391",
          "CHEMBL1980407",
          "CHEMBL1980671",
          "CHEMBL1980763",
          "CHEMBL1980995",
          "CHEMBL1981047",
          "CHEMBL1981133",
          "CHEMBL1981215",
          "CHEMBL1981744",
          "CHEMBL1981792",
          "CHEMBL1982413",
          "CHEMBL1982660",
          "CHEMBL1982700",
          "CHEMBL1982711",
          "CHEMBL1983070",
          "CHEMBL1983111",
          "CHEMBL1983268",
          "CHEMBL1983348",
          "CHEMBL1983393",
          "CHEMBL1983575",
          "CHEMBL1983630",
          "CHEMBL1983640",
          "CHEMBL1983715",
          "CHEMBL1983923",
          "CHEMBL1983945",
          "CHEMBL1983980",
          "CHEMBL1984038",
          "CHEMBL1984236",
          "CHEMBL1984296",
          "CHEMBL1984500",
          "CHEMBL1984686",
          "CHEMBL1984760",
          "CHEMBL1984842",
          "CHEMBL1984847",
          "CHEMBL1985206",
          "CHEMBL1985367",
          "CHEMBL1985681",
          "CHEMBL1986143",
          "CHEMBL1986177",
          "CHEMBL1986265",
          "CHEMBL1986503",
          "CHEMBL1986590",
          "CHEMBL1986756",
          "CHEMBL1986899",
          "CHEMBL1986943",
          "CHEMBL1987430",
          "CHEMBL1987535",
          "CHEMBL1987815",
          "CHEMBL1987998",
          "CHEMBL1988141",
          "CHEMBL1988437",
          "CHEMBL1988581",
          "CHEMBL1988692",
          "CHEMBL1988805",
          "CHEMBL1989043",
          "CHEMBL1989267",
          "CHEMBL1989423",
          "CHEMBL1989471",
          "CHEMBL1989708",
          "CHEMBL1990223",
          "CHEMBL1990254",
          "CHEMBL1990496",
          "CHEMBL1990590",
          "CHEMBL1990885",
          "CHEMBL1991410",
          "CHEMBL1991678",
          "CHEMBL1991734",
          "CHEMBL1991782",
          "CHEMBL1992042",
          "CHEMBL1992073",
          "CHEMBL1992125",
          "CHEMBL1992371",
          "CHEMBL1992581",
          "CHEMBL1992937",
          "CHEMBL1993335",
          "CHEMBL1993374",
          "CHEMBL1993413",
          "CHEMBL1993661",
          "CHEMBL1993877",
          "CHEMBL1993904",
          "CHEMBL1994159",
          "CHEMBL1994308",
          "CHEMBL1994318",
          "CHEMBL1994526",
          "CHEMBL1994555",
          "CHEMBL1994724",
          "CHEMBL1994808",
          "CHEMBL1994977",
          "CHEMBL1995172",
          "CHEMBL1995211",
          "CHEMBL1995765",
          "CHEMBL1995811",
          "CHEMBL1996048",
          "CHEMBL1996176",
          "CHEMBL1996345",
          "CHEMBL1996500",
          "CHEMBL1996510",
          "CHEMBL1996576",
          "CHEMBL1996646",
          "CHEMBL1996649",
          "CHEMBL1996702",
          "CHEMBL1996795",
          "CHEMBL1996837",
          "CHEMBL1997007",
          "CHEMBL1997041",
          "CHEMBL1997119",
          "CHEMBL1997193",
          "CHEMBL1997197",
          "CHEMBL1997275",
          "CHEMBL1997335",
          "CHEMBL1997611",
          "CHEMBL1997892",
          "CHEMBL1998110",
          "CHEMBL1998253",
          "CHEMBL1998470",
          "CHEMBL1998477",
          "CHEMBL1998680",
          "CHEMBL1999414",
          "CHEMBL1999484",
          "CHEMBL1999506",
          "CHEMBL2000029",
          "CHEMBL2000568",
          "CHEMBL2000724",
          "CHEMBL2000879",
          "CHEMBL2001019",
          "CHEMBL2001149",
          "CHEMBL2001539",
          "CHEMBL2001584",
          "CHEMBL2001641",
          "CHEMBL2001923",
          "CHEMBL2001987",
          "CHEMBL2002099",
          "CHEMBL2002202",
          "CHEMBL2002432",
          "CHEMBL2002450",
          "CHEMBL2002471",
          "CHEMBL2002586",
          "CHEMBL2002599",
          "CHEMBL2002690",
          "CHEMBL2002723",
          "CHEMBL2002992",
          "CHEMBL2003514",
          "CHEMBL2003689",
          "CHEMBL2003785",
          "CHEMBL2004025",
          "CHEMBL2004033",
          "CHEMBL2004118",
          "CHEMBL2004159",
          "CHEMBL2004290",
          "CHEMBL2004438",
          "CHEMBL2004515",
          "CHEMBL2004637",
          "CHEMBL2004887",
          "CHEMBL2005449",
          "CHEMBL2005478",
          "CHEMBL2005699",
          "CHEMBL2005792",
          "CHEMBL2006299",
          "CHEMBL2006450",
          "CHEMBL2006564",
          "CHEMBL2006674",
          "CHEMBL2006765",
          "CHEMBL2007097",
          "CHEMBL2007124",
          "CHEMBL2007266",
          "CHEMBL2007375",
          "CHEMBL2007421",
          "CHEMBL2007479",
          "CHEMBL2007559",
          "CHEMBL2007574",
          "CHEMBL2012519",
          "CHEMBL202721",
          "CHEMBL2029988",
          "CHEMBL2057830",
          "CHEMBL21156",
          "CHEMBL215152",
          "CHEMBL2205766",
          "CHEMBL221959",
          "CHEMBL223360",
          "CHEMBL225519",
          "CHEMBL230011",
          "CHEMBL2309006",
          "CHEMBL2309609",
          "CHEMBL234085",
          "CHEMBL235157",
          "CHEMBL242865",
          "CHEMBL24828",
          "CHEMBL249697",
          "CHEMBL253969",
          "CHEMBL255863",
          "CHEMBL259084",
          "CHEMBL259922",
          "CHEMBL261237",
          "CHEMBL261849",
          "CHEMBL262623",
          "CHEMBL278041",
          "CHEMBL288441",
          "CHEMBL296468",
          "CHEMBL300138",
          "CHEMBL31965",
          "CHEMBL34704",
          "CHEMBL360847",
          "CHEMBL377300",
          "CHEMBL379218",
          "CHEMBL379975",
          "CHEMBL38380",
          "CHEMBL384304",
          "CHEMBL386051",
          "CHEMBL391586",
          "CHEMBL398951",
          "CHEMBL402818",
          "CHEMBL406845",
          "CHEMBL415049",
          "CHEMBL422897",
          "CHEMBL428690",
          "CHEMBL440084",
          "CHEMBL445813",
          "CHEMBL450786",
          "CHEMBL451401",
          "CHEMBL458997",
          "CHEMBL461876",
          "CHEMBL464552",
          "CHEMBL475251",
          "CHEMBL477772",
          "CHEMBL482538",
          "CHEMBL482767",
          "CHEMBL483158",
          "CHEMBL483321",
          "CHEMBL49120",
          "CHEMBL491473",
          "CHEMBL494089",
          "CHEMBL50894",
          "CHEMBL509032",
          "CHEMBL513909",
          "CHEMBL521851",
          "CHEMBL522892",
          "CHEMBL525191",
          "CHEMBL535",
          "CHEMBL546797",
          "CHEMBL550418",
          "CHEMBL553",
          "CHEMBL554",
          "CHEMBL558752",
          "CHEMBL565612",
          "CHEMBL568880",
          "CHEMBL568920",
          "CHEMBL568921",
          "CHEMBL569340",
          "CHEMBL569588",
          "CHEMBL570474",
          "CHEMBL570488",
          "CHEMBL571137",
          "CHEMBL571580",
          "CHEMBL571797",
          "CHEMBL571823",
          "CHEMBL572225",
          "CHEMBL572878",
          "CHEMBL572881",
          "CHEMBL573339",
          "CHEMBL574738",
          "CHEMBL576982",
          "CHEMBL577304",
          "CHEMBL583679",
          "CHEMBL592030",
          "CHEMBL601719",
          "CHEMBL607707",
          "CHEMBL608154",
          "CHEMBL91829",
          "CHEMBL939",
          "CHEMBL941",
          "CHEMBL95692",
          "CHEMBL97162"
        ],
        "number_of_missing_values": "0"
      },
      {
        "data_type": "numeric",
        "index": "1",
        "is_ignore": "false",
        "is_row_identifier": "false",
        "is_target": "false",
        "name": "MW",
        "number_of_missing_values": "0"
      },
      {
        "data_type": "numeric",
        "index": "2",
        "is_ignore": "false",
        "is_row_identifier": "false",
        "is_target": "false",
        "name": "Sv",
        "number_of_missing_values": "0"
      },
      {
        "data_type": "numeric",
        "index": "3",
        "is_ignore": "false",
        "is_row_identifier": "false",
        "is_target": "true",
        "name": "pXC50",
        "number_of_missing_values": "0"
      }
    ]
  }
}