"molecule_id","AMW","C.","pXC50"
{1 9.113,2 26.3,3 4}
{0 CHEMBL1098101,1 8.508,2 27.3,3 4.387}
{0 CHEMBL121915,1 14.134,2 30.4,3 6.854}
{0 CHEMBL13378,1 8.095,2 30.4,3 4}
{0 CHEMBL154535,1 8.77,2 33.3,3 4.526}
{0 CHEMBL1738726,1 10.14,2 38.5,3 5.128}
{0 CHEMBL1812596,1 9.818,2 34.6,3 5.991}
{0 CHEMBL1812597,1 8.594,2 36.1,3 4.141}
{0 CHEMBL1812598,1 9.818,2 34.6,3 5.323}
{0 CHEMBL1812599,1 10.14,2 38.5,3 4.27}
{0 CHEMBL193087,1 8.303,2 29.4,3 4.149}
{0 CHEMBL2092841,1 8.77,2 33.3,3 4.268}
{0 CHEMBL22304,1 7.644,2 24.2,3 4}
{0 CHEMBL2312396,1 7.538,2 32.4,3 6.733}
{0 CHEMBL2312397,1 7.547,2 35.9,3 5.332}
{0 CHEMBL2312398,1 7.037,2 28.6,3 5.268}
{0 CHEMBL2312399,1 6.692,2 29.3,3 5.483}
{0 CHEMBL2312400,1 6.818,2 31,3 5.238}
{0 CHEMBL2312401,1 6.913,2 28.6,3 4.352}
{0 CHEMBL2312402,1 7.543,2 34.9,3 5.551}
{0 CHEMBL2312403,1 7.523,2 27.3,3 6.91}
{0 CHEMBL2312680,1 7.545,2 34.1,3 5.247}
{0 CHEMBL2312681,1 7.543,2 34.9,3 6.664}
{0 CHEMBL2312682,1 7.701,2 30.8,3 7.462}
{0 CHEMBL2312683,1 7.808,2 26.7,3 6.622}
{0 CHEMBL2312684,1 7.046,2 25.9,3 6.469}
{0 CHEMBL2312685,1 6.809,2 26.7,3 4.991}
{0 CHEMBL2312686,1 7.201,2 30.8,3 5.602}
{0 CHEMBL27130,1 7.134,2 31.3,3 5.597}
{0 CHEMBL274440,1 7.507,2 23.3,3 4}
{0 CHEMBL275040,1 7.109,2 33.3,3 7.484}
{0 CHEMBL276815,1 8.095,2 30.4,3 4.37}
{0 CHEMBL279561,1 6.727,2 31.3,3 6.433}
{0 CHEMBL279956,1 9.458,2 25,3 5.819}
{0 CHEMBL28472,1 7.686,2 35.5,3 6.701}
{0 CHEMBL288166,1 7.326,2 27.3,3 8.288}
{0 CHEMBL28862,1 8.215,2 20.8,3 4}
{0 CHEMBL30285,1 9.302,2 29.4,3 5.759}
{0 CHEMBL314690,1 7.958,2 30,3 6.155}
{0 CHEMBL337577,1 7.975,2 33.3,3 5.293}
{0 CHEMBL350704,1 7.113,2 41.7,3 4.879}
{0 CHEMBL351653,1 6.983,2 36.8,3 5.502}
{0 CHEMBL370038,1 9.08,2 28.6,3 6.959}
{0 CHEMBL370941,1 8.654,2 29,3 5.456}
{0 CHEMBL372643,1 8.303,2 29.4,3 4.495}
{0 CHEMBL373428,1 9.061,2 35.9,3 7.638}
{0 CHEMBL39338,1 6.97,2 41.2,3 5.471}
{0 CHEMBL39664,1 7.971,2 25,3 4}
{0 CHEMBL40123,1 7.276,2 42.2,3 4}
{0 CHEMBL431029,1 9.18,2 21.7,3 4}
{0 CHEMBL479804,1 7.526,2 27.6,3 5.57}
{0 CHEMBL479805,1 7.037,2 28.6,3 5.476}
{0 CHEMBL480169,1 7.245,2 40,3 4}
{0 CHEMBL482080,1 7.524,2 29,3 5.996}
{0 CHEMBL482097,1 7.241,2 34.9,3 8.418}
{0 CHEMBL492469,1 9.189,2 32.1,3 5.488}
{0 CHEMBL492630,1 9.818,2 34.6,3 5.438}
{0 CHEMBL500042,1 7.258,2 28.1,3 7.271}
{0 CHEMBL518313,1 7.342,2 35.7,3 4.67}
{0 CHEMBL553028,1 7.421,2 35.3,3 5.86}
{0 CHEMBL575060,1 7.745,2 26.3,3 6.308}
{0 CHEMBL72366,1 10.33,2 30,3 4.022}
{0 CHEMBL73698,1 12.553,2 30,3 4}
{0 CHEMBL94859,1 9.08,2 28.6,3 6.481}
