"molecule_id","Sp","Sv","pXC50"
{1 27.716,2 27.518,3 6.147}
{0 CHEMBL17,1 17.125,2 16.512,3 5.697}
{0 CHEMBL18,1 18.716,2 17.669,3 7.569}
{0 CHEMBL19,1 15.205,2 14.658,3 6.18}
{0 CHEMBL20,1 13.443,2 13.131,3 8.046}
{0 CHEMBL21,1 12.852,2 12.24,3 4.529}
{0 CHEMBL2179304,1 28.034,2 26.523,3 6.842}
{0 CHEMBL2179305,1 26.273,2 24.997,3 6.564}
{0 CHEMBL2179306,1 28.602,2 28.179,3 6.447}
{0 CHEMBL2179307,1 27.886,2 26.33,3 6.629}
{0 CHEMBL2179308,1 29.244,2 27.744,3 6.215}
{0 CHEMBL218490,1 24.102,2 22.151,3 7.004}
{0 CHEMBL220491,1 29.085,2 26.941,3 6.896}
{0 CHEMBL220492,1 25.903,2 25.195,3 6.324}
{0 CHEMBL26,1 29.097,2 27.379,3 6.575}
{0 CHEMBL265674,1 10.227,2 9.889,3 5.68}
{0 CHEMBL266026,1 25.699,2 24.458,3 5.493}
{0 CHEMBL266240,1 17.273,2 16.706,3 4.488}
{0 CHEMBL268177,1 15.511,2 13.557,3 4.489}
{0 CHEMBL268439,1 21.312,2 20.581,3 6.01}
{0 CHEMBL310671,1 12.54,2 12.407,3 6.101}
{0 CHEMBL328560,1 21.693,2 20.437,3 6.178}
{0 CHEMBL360356,1 17.602,2 16.749,3 4.345}
{0 CHEMBL414,1 13.756,2 13.648,3 4.407}
{0 CHEMBL418,1 17.989,2 18.555,3 4.529}
{0 CHEMBL419,1 14.614,2 13.767,3 4.513}
{0 CHEMBL451332,1 17.278,2 16.702,3 4.547}
{0 CHEMBL574,1 13.608,2 12.745,3 4.41}
{0 CHEMBL6633,1 19.869,2 19.304,3 5.58}
{0 CHEMBL6705,1 12.852,2 12.24,3 4.472}
{0 CHEMBL6724,1 14.205,2 13.265,3 4.5}
{0 CHEMBL6753,1 11.989,2 11.416,3 5.623}
{0 CHEMBL6784,1 15.824,2 14.987,3 4.462}
{0 CHEMBL6853,1 12.79,2 12.623,3 4.539}
{0 CHEMBL6919,1 14.062,2 13.46,3 4.417}
{0 CHEMBL7087,1 16.375,2 15.294,3 4.536}
{0 CHEMBL7092,1 13.71,2 13.067,3 4.558}
{0 CHEMBL7146,1 27.46,2 25.985,3 5.64}
{0 CHEMBL73962,1 20.307,2 19.56,3 6.331}
{0 CHEMBL750,1 15.307,2 14.955,3 6.057}
{0 CHEMBL77517,1 26.795,2 25.759,3 6.144}
{0 CHEMBL865,1 25.591,2 24.535,3 6.166}
