{
  "data_features": {
    "feature": [
      {
        "data_type": "nominal",
        "index": "0",
        "is_ignore": "false",
        "is_row_identifier": "true",
        "is_target": "false",
        "name": "molecule_id",
        "nominal_value": [
          "CHEMBL117966",
          "CHEMBL1224755",
          "CHEMBL1256686",
          "CHEMBL1299463",
          "CHEMBL1299467",
          "CHEMBL1300317",
          "CHEMBL1300494",
          "CHEMBL1301125",
          "CHEMBL1301480",
          "CHEMBL1302406",
          "CHEMBL1303281",
          "CHEMBL1303463",
          "CHEMBL1303714",
          "CHEMBL1303719",
          "CHEMBL1303810",
          "CHEMBL1304919",
          "CHEMBL1305283",
          "CHEMBL1305292",
          "CHEMBL1306258",
          "CHEMBL1307404",
          "CHEMBL1307972",
          "CHEMBL1308168",
          "CHEMBL1309232",
          "CHEMBL1309448",
          "CHEMBL1309733",
          "CHEMBL1309991",
          "CHEMBL1310036",
          "CHEMBL1310132",
          "CHEMBL1310221",
          "CHEMBL1310617",
          "CHEMBL1310804",
          "CHEMBL1311185",
          "CHEMBL1311466",
          "CHEMBL1311729",
          "CHEMBL1312016",
          "CHEMBL1312928",
          "CHEMBL1313077",
          "CHEMBL1313521",
          "CHEMBL1313554",
          "CHEMBL1318970",
          "CHEMBL1319204",
          "CHEMBL1319488",
          "CHEMBL1319518",
          "CHEMBL1319618",
          "CHEMBL1319676",
          "CHEMBL1319933",
          "CHEMBL1321531",
          "CHEMBL1321538",
          "CHEMBL1321645",
          "CHEMBL1322082",
          "CHEMBL1322557",
          "CHEMBL1323101",
          "CHEMBL1323139",
          "CHEMBL1323248",
          "CHEMBL1323864",
          "CHEMBL1324125",
          "CHEMBL1324256",
          "CHEMBL1325168",
          "CHEMBL1325729",
          "CHEMBL1325823",
          "CHEMBL1326110",
          "CHEMBL1326118",
          "CHEMBL1327596",
          "CHEMBL1327721",
          "CHEMBL1328168",
          "CHEMBL1328169",
          "CHEMBL1329054",
          "CHEMBL1329610",
          "CHEMBL1329798",
          "CHEMBL1330736",
          "CHEMBL1332308",
          "CHEMBL1332979",
          "CHEMBL1334253",
          "CHEMBL1334291",
          "CHEMBL1334404",
          "CHEMBL1334593",
          "CHEMBL1334984",
          "CHEMBL1335165",
          "CHEMBL1335176",
          "CHEMBL1335224",
          "CHEMBL1335610",
          "CHEMBL1335844",
          "CHEMBL1335988",
          "CHEMBL1336197",
          "CHEMBL1336745",
          "CHEMBL1336781",
          "CHEMBL1337193",
          "CHEMBL1337226",
          "CHEMBL1337235",
          "CHEMBL1337445",
          "CHEMBL1337500",
          "CHEMBL1337592",
          "CHEMBL1337602",
          "CHEMBL1338150",
          "CHEMBL1338958",
          "CHEMBL1339398",
          "CHEMBL1339433",
          "CHEMBL1340420",
          "CHEMBL1340447",
          "CHEMBL1340713",
          "CHEMBL1341008",
          "CHEMBL1341040",
          "CHEMBL1341970",
          "CHEMBL1341981",
          "CHEMBL1342665",
          "CHEMBL1342907",
          "CHEMBL1342913",
          "CHEMBL1343725",
          "CHEMBL1344294",
          "CHEMBL1344875",
          "CHEMBL1345063",
          "CHEMBL1345285",
          "CHEMBL1345414",
          "CHEMBL1345518",
          "CHEMBL1345961",
          "CHEMBL1345993",
          "CHEMBL1346062",
          "CHEMBL1346096",
          "CHEMBL1346640",
          "CHEMBL1347144",
          "CHEMBL1347390",
          "CHEMBL1347846",
          "CHEMBL1347962",
          "CHEMBL1348803",
          "CHEMBL1349113",
          "CHEMBL1349180",
          "CHEMBL1349225",
          "CHEMBL1349625",
          "CHEMBL1349727",
          "CHEMBL1349747",
          "CHEMBL1350078",
          "CHEMBL1351052",
          "CHEMBL1351269",
          "CHEMBL1351583",
          "CHEMBL1351827",
          "CHEMBL1352168",
          "CHEMBL1352270",
          "CHEMBL1352375",
          "CHEMBL1352586",
          "CHEMBL1352681",
          "CHEMBL1352854",
          "CHEMBL1353664",
          "CHEMBL1353886",
          "CHEMBL1358180",
          "CHEMBL1358722",
          "CHEMBL1359560",
          "CHEMBL1359709",
          "CHEMBL1359788",
          "CHEMBL1360002",
          "CHEMBL1360493",
          "CHEMBL1360539",
          "CHEMBL1360959",
          "CHEMBL1361774",
          "CHEMBL1361821",
          "CHEMBL1361883",
          "CHEMBL1362109",
          "CHEMBL1362660",
          "CHEMBL1362663",
          "CHEMBL1363219",
          "CHEMBL1363322",
          "CHEMBL1363514",
          "CHEMBL1363614",
          "CHEMBL1363662",
          "CHEMBL1364411",
          "CHEMBL1364960",
          "CHEMBL1365185",
          "CHEMBL1365290",
          "CHEMBL1365696",
          "CHEMBL1366836",
          "CHEMBL1366942",
          "CHEMBL1367089",
          "CHEMBL1367316",
          "CHEMBL1367572",
          "CHEMBL1367885",
          "CHEMBL1369492",
          "CHEMBL1369671",
          "CHEMBL1370379",
          "CHEMBL1370884",
          "CHEMBL1371362",
          "CHEMBL1371873",
          "CHEMBL1371946",
          "CHEMBL1372052",
          "CHEMBL1372377",
          "CHEMBL1372889",
          "CHEMBL1372914",
          "CHEMBL1373339",
          "CHEMBL1373822",
          "CHEMBL1374298",
          "CHEMBL1374384",
          "CHEMBL1374511",
          "CHEMBL1374835",
          "CHEMBL1374860",
          "CHEMBL1374970",
          "CHEMBL1375054",
          "CHEMBL1375155",
          "CHEMBL1375159",
          "CHEMBL1375338",
          "CHEMBL1376647",
          "CHEMBL1376741",
          "CHEMBL1377095",
          "CHEMBL1377193",
          "CHEMBL1377682",
          "CHEMBL1377878",
          "CHEMBL1379136",
          "CHEMBL1379970",
          "CHEMBL1379991",
          "CHEMBL1380000",
          "CHEMBL1381257",
          "CHEMBL1381567",
          "CHEMBL1381768",
          "CHEMBL1381814",
          "CHEMBL1382323",
          "CHEMBL1382438",
          "CHEMBL1382884",
          "CHEMBL1383635",
          "CHEMBL1384167",
          "CHEMBL1384253",
          "CHEMBL1384702",
          "CHEMBL1384974",
          "CHEMBL1385055",
          "CHEMBL1385193",
          "CHEMBL1385295",
          "CHEMBL1385413",
          "CHEMBL1386517",
          "CHEMBL1386604",
          "CHEMBL1386876",
          "CHEMBL1387110",
          "CHEMBL1387156",
          "CHEMBL1387359",
          "CHEMBL1387474",
          "CHEMBL1387563",
          "CHEMBL1387767",
          "CHEMBL1387790",
          "CHEMBL1388457",
          "CHEMBL1388639",
          "CHEMBL1388831",
          "CHEMBL1389966",
          "CHEMBL1390139",
          "CHEMBL1390360",
          "CHEMBL1390659",
          "CHEMBL1391630",
          "CHEMBL1392142",
          "CHEMBL1392160",
          "CHEMBL1392313",
          "CHEMBL1392551",
          "CHEMBL1392570",
          "CHEMBL1393615",
          "CHEMBL1393914",
          "CHEMBL1398660",
          "CHEMBL1399102",
          "CHEMBL1399191",
          "CHEMBL1399198",
          "CHEMBL1399698",
          "CHEMBL1400196",
          "CHEMBL1400761",
          "CHEMBL1401645",
          "CHEMBL1402055",
          "CHEMBL1402473",
          "CHEMBL1402510",
          "CHEMBL1403242",
          "CHEMBL1404138",
          "CHEMBL1404541",
          "CHEMBL1404904",
          "CHEMBL1405952",
          "CHEMBL1405957",
          "CHEMBL1405964",
          "CHEMBL1406097",
          "CHEMBL1406161",
          "CHEMBL1406703",
          "CHEMBL1407622",
          "CHEMBL1407650",
          "CHEMBL1409272",
          "CHEMBL1409883",
          "CHEMBL1409900",
          "CHEMBL1410479",
          "CHEMBL1410689",
          "CHEMBL1411089",
          "CHEMBL1411310",
          "CHEMBL1411912",
          "CHEMBL1412369",
          "CHEMBL1412583",
          "CHEMBL1413324",
          "CHEMBL1413495",
          "CHEMBL1413661",
          "CHEMBL1413963",
          "CHEMBL1414873",
          "CHEMBL1414964",
          "CHEMBL1415413",
          "CHEMBL1415425",
          "CHEMBL1415841",
          "CHEMBL1415893",
          "CHEMBL1416584",
          "CHEMBL1417604",
          "CHEMBL1417937",
          "CHEMBL1418598",
          "CHEMBL1419012",
          "CHEMBL1419438",
          "CHEMBL1419822",
          "CHEMBL1420175",
          "CHEMBL1420393",
          "CHEMBL1420411",
          "CHEMBL1420589",
          "CHEMBL1420682",
          "CHEMBL1420717",
          "CHEMBL1421112",
          "CHEMBL1421347",
          "CHEMBL1421518",
          "CHEMBL1422030",
          "CHEMBL1422126",
          "CHEMBL1422158",
          "CHEMBL1422386",
          "CHEMBL1422414",
          "CHEMBL1422538",
          "CHEMBL1422635",
          "CHEMBL1422689",
          "CHEMBL1422887",
          "CHEMBL1423",
          "CHEMBL1423022",
          "CHEMBL1423839",
          "CHEMBL1424243",
          "CHEMBL1424264",
          "CHEMBL1424968",
          "CHEMBL1425166",
          "CHEMBL1425486",
          "CHEMBL1425525",
          "CHEMBL1425823",
          "CHEMBL1426059",
          "CHEMBL1426165",
          "CHEMBL1426411",
          "CHEMBL1426695",
          "CHEMBL1427221",
          "CHEMBL1427233",
          "CHEMBL1427279",
          "CHEMBL1427397",
          "CHEMBL1427542",
          "CHEMBL1427549",
          "CHEMBL1428071",
          "CHEMBL1428228",
          "CHEMBL1428417",
          "CHEMBL142868",
          "CHEMBL1429129",
          "CHEMBL1429297",
          "CHEMBL1429906",
          "CHEMBL1429929",
          "CHEMBL1430166",
          "CHEMBL1430262",
          "CHEMBL1430425",
          "CHEMBL1430895",
          "CHEMBL1430935",
          "CHEMBL1431118",
          "CHEMBL1431662",
          "CHEMBL1432484",
          "CHEMBL1437997",
          "CHEMBL1438038",
          "CHEMBL1438319",
          "CHEMBL1438601",
          "CHEMBL1438877",
          "CHEMBL1438881",
          "CHEMBL1438983",
          "CHEMBL1439773",
          "CHEMBL1439938",
          "CHEMBL1440300",
          "CHEMBL1440507",
          "CHEMBL1441304",
          "CHEMBL1441545",
          "CHEMBL1441792",
          "CHEMBL1442537",
          "CHEMBL1442661",
          "CHEMBL1442700",
          "CHEMBL1442818",
          "CHEMBL1443105",
          "CHEMBL1443632",
          "CHEMBL1444031",
          "CHEMBL1444103",
          "CHEMBL1444142",
          "CHEMBL1444859",
          "CHEMBL1445372",
          "CHEMBL1445710",
          "CHEMBL1445776",
          "CHEMBL1445889",
          "CHEMBL1445962",
          "CHEMBL1446234",
          "CHEMBL1446403",
          "CHEMBL1446421",
          "CHEMBL1446480",
          "CHEMBL1446971",
          "CHEMBL1447341",
          "CHEMBL1447697",
          "CHEMBL1447906",
          "CHEMBL1448592",
          "CHEMBL1448637",
          "CHEMBL1448732",
          "CHEMBL1448771",
          "CHEMBL1448941",
          "CHEMBL1449103",
          "CHEMBL1449794",
          "CHEMBL1449920",
          "CHEMBL1450156",
          "CHEMBL1450266",
          "CHEMBL1450615",
          "CHEMBL1450616",
          "CHEMBL1450948",
          "CHEMBL1451278",
          "CHEMBL1451348",
          "CHEMBL1451738",
          "CHEMBL1451950",
          "CHEMBL1452159",
          "CHEMBL1452795",
          "CHEMBL1453108",
          "CHEMBL1453212",
          "CHEMBL1453673",
          "CHEMBL1453722",
          "CHEMBL1453834",
          "CHEMBL1453996",
          "CHEMBL1454183",
          "CHEMBL1454820",
          "CHEMBL1455039",
          "CHEMBL1455786",
          "CHEMBL1455813",
          "CHEMBL1456379",
          "CHEMBL1456676",
          "CHEMBL1457060",
          "CHEMBL1457194",
          "CHEMBL1457594",
          "CHEMBL1458022",
          "CHEMBL1458479",
          "CHEMBL1458548",
          "CHEMBL1459140",
          "CHEMBL1459155",
          "CHEMBL1459292",
          "CHEMBL1459578",
          "CHEMBL1459746",
          "CHEMBL1459795",
          "CHEMBL1460004",
          "CHEMBL1460029",
          "CHEMBL1460235",
          "CHEMBL1460352",
          "CHEMBL1460872",
          "CHEMBL1460889",
          "CHEMBL1461009",
          "CHEMBL1461016",
          "CHEMBL1461400",
          "CHEMBL1461933",
          "CHEMBL1462352",
          "CHEMBL1462568",
          "CHEMBL1463172",
          "CHEMBL1463598",
          "CHEMBL1463713",
          "CHEMBL1463847",
          "CHEMBL1464075",
          "CHEMBL1464261",
          "CHEMBL1464634",
          "CHEMBL1464853",
          "CHEMBL1464968",
          "CHEMBL1465040",
          "CHEMBL1465353",
          "CHEMBL1465527",
          "CHEMBL1465592",
          "CHEMBL1465624",
          "CHEMBL1467102",
          "CHEMBL1467284",
          "CHEMBL1467531",
          "CHEMBL1467896",
          "CHEMBL1467956",
          "CHEMBL1467999",
          "CHEMBL1468721",
          "CHEMBL1469035",
          "CHEMBL1469567",
          "CHEMBL1469847",
          "CHEMBL1469916",
          "CHEMBL1470112",
          "CHEMBL1470148",
          "CHEMBL1470367",
          "CHEMBL1470373",
          "CHEMBL1470914",
          "CHEMBL1471141",
          "CHEMBL1471146",
          "CHEMBL1471737",
          "CHEMBL1471930",
          "CHEMBL1472409",
          "CHEMBL1472426",
          "CHEMBL1477760",
          "CHEMBL1477778",
          "CHEMBL1478901",
          "CHEMBL1479316",
          "CHEMBL1479340",
          "CHEMBL1480424",
          "CHEMBL1480939",
          "CHEMBL1481551",
          "CHEMBL1481709",
          "CHEMBL1481836",
          "CHEMBL1481900",
          "CHEMBL1482292",
          "CHEMBL1482663",
          "CHEMBL1482670",
          "CHEMBL1482998",
          "CHEMBL1483047",
          "CHEMBL1484741",
          "CHEMBL1485112",
          "CHEMBL1485865",
          "CHEMBL1485945",
          "CHEMBL1486340",
          "CHEMBL1486651",
          "CHEMBL1487337",
          "CHEMBL1487444",
          "CHEMBL1487938",
          "CHEMBL1488563",
          "CHEMBL1489294",
          "CHEMBL1489479",
          "CHEMBL1489538",
          "CHEMBL1490677",
          "CHEMBL1490797",
          "CHEMBL1490887",
          "CHEMBL1491402",
          "CHEMBL1491705",
          "CHEMBL1492098",
          "CHEMBL1492648",
          "CHEMBL1492922",
          "CHEMBL1493101",
          "CHEMBL1493204",
          "CHEMBL1493251",
          "CHEMBL1493351",
          "CHEMBL1493396",
          "CHEMBL1494120",
          "CHEMBL1494650",
          "CHEMBL1496353",
          "CHEMBL1496362",
          "CHEMBL1496662",
          "CHEMBL1496754",
          "CHEMBL1497295",
          "CHEMBL1497323",
          "CHEMBL1497463",
          "CHEMBL1497549",
          "CHEMBL1497597",
          "CHEMBL1497939",
          "CHEMBL1497950",
          "CHEMBL1498509",
          "CHEMBL1498599",
          "CHEMBL1499127",
          "CHEMBL1499792",
          "CHEMBL1499893",
          "CHEMBL1499951",
          "CHEMBL1500422",
          "CHEMBL1500489",
          "CHEMBL1500565",
          "CHEMBL1500686",
          "CHEMBL1500719",
          "CHEMBL1500887",
          "CHEMBL1501078",
          "CHEMBL1501217",
          "CHEMBL1501495",
          "CHEMBL1501539",
          "CHEMBL1501680",
          "CHEMBL1503152",
          "CHEMBL1503786",
          "CHEMBL1503834",
          "CHEMBL1503962",
          "CHEMBL1504590",
          "CHEMBL1504897",
          "CHEMBL1505206",
          "CHEMBL1505479",
          "CHEMBL1505552",
          "CHEMBL1505674",
          "CHEMBL1505902",
          "CHEMBL1505922",
          "CHEMBL1506229",
          "CHEMBL1506527",
          "CHEMBL1507250",
          "CHEMBL1507337",
          "CHEMBL1507523",
          "CHEMBL1507704",
          "CHEMBL1507929",
          "CHEMBL1508182",
          "CHEMBL1508875",
          "CHEMBL1508896",
          "CHEMBL1508953",
          "CHEMBL1508982",
          "CHEMBL1509108",
          "CHEMBL1509120",
          "CHEMBL1509638",
          "CHEMBL1510714",
          "CHEMBL1510761",
          "CHEMBL1510833",
          "CHEMBL1511363",
          "CHEMBL1511795",
          "CHEMBL1516406",
          "CHEMBL1516857",
          "CHEMBL1517092",
          "CHEMBL1517738",
          "CHEMBL1517752",
          "CHEMBL1517755",
          "CHEMBL1518240",
          "CHEMBL1518326",
          "CHEMBL1518672",
          "CHEMBL1518766",
          "CHEMBL1518802",
          "CHEMBL1518874",
          "CHEMBL1518905",
          "CHEMBL1519375",
          "CHEMBL1519411",
          "CHEMBL1519585",
          "CHEMBL1520407",
          "CHEMBL1520507",
          "CHEMBL1520595",
          "CHEMBL1520777",
          "CHEMBL1520837",
          "CHEMBL1521702",
          "CHEMBL1521960",
          "CHEMBL1522184",
          "CHEMBL1522800",
          "CHEMBL1523019",
          "CHEMBL1523651",
          "CHEMBL1523699",
          "CHEMBL1523938",
          "CHEMBL1524101",
          "CHEMBL1524152",
          "CHEMBL1524306",
          "CHEMBL1524393",
          "CHEMBL1524484",
          "CHEMBL1524500",
          "CHEMBL1525530",
          "CHEMBL1525956",
          "CHEMBL1526304",
          "CHEMBL1526751",
          "CHEMBL1526855",
          "CHEMBL1527794",
          "CHEMBL1527838",
          "CHEMBL1528367",
          "CHEMBL1528880",
          "CHEMBL1530031",
          "CHEMBL1530161",
          "CHEMBL1531073",
          "CHEMBL1531906",
          "CHEMBL1532114",
          "CHEMBL1532375",
          "CHEMBL1532377",
          "CHEMBL1532453",
          "CHEMBL1532668",
          "CHEMBL1532953",
          "CHEMBL1532955",
          "CHEMBL1533351",
          "CHEMBL1533366",
          "CHEMBL1534001",
          "CHEMBL1534395",
          "CHEMBL1535134",
          "CHEMBL1535169",
          "CHEMBL1535252",
          "CHEMBL1535546",
          "CHEMBL1537098",
          "CHEMBL1537489",
          "CHEMBL1537509",
          "CHEMBL1538215",
          "CHEMBL1538357",
          "CHEMBL1539180",
          "CHEMBL1539224",
          "CHEMBL1539280",
          "CHEMBL1539307",
          "CHEMBL1539520",
          "CHEMBL1540036",
          "CHEMBL1540112",
          "CHEMBL1540571",
          "CHEMBL1540783",
          "CHEMBL1541177",
          "CHEMBL1541339",
          "CHEMBL1541441",
          "CHEMBL1541566",
          "CHEMBL1541735",
          "CHEMBL1541809",
          "CHEMBL1541829",
          "CHEMBL1541840",
          "CHEMBL1541967",
          "CHEMBL1542470",
          "CHEMBL1543875",
          "CHEMBL1544093",
          "CHEMBL1544131",
          "CHEMBL1544559",
          "CHEMBL1544664",
          "CHEMBL1544737",
          "CHEMBL1544818",
          "CHEMBL1545093",
          "CHEMBL1545250",
          "CHEMBL1545361",
          "CHEMBL1545384",
          "CHEMBL1545479",
          "CHEMBL1545556",
          "CHEMBL1545584",
          "CHEMBL1545727",
          "CHEMBL1546628",
          "CHEMBL1546843",
          "CHEMBL1547342",
          "CHEMBL1547559",
          "CHEMBL1548968",
          "CHEMBL1549840",
          "CHEMBL1550016",
          "CHEMBL1550518",
          "CHEMBL1550734",
          "CHEMBL1555483",
          "CHEMBL155563",
          "CHEMBL1555650",
          "CHEMBL1555899",
          "CHEMBL1555913",
          "CHEMBL1555935",
          "CHEMBL1556017",
          "CHEMBL1556055",
          "CHEMBL1557081",
          "CHEMBL1557741",
          "CHEMBL1557782",
          "CHEMBL1558210",
          "CHEMBL1558625",
          "CHEMBL1558724",
          "CHEMBL1558847",
          "CHEMBL1558914",
          "CHEMBL1558958",
          "CHEMBL1559968",
          "CHEMBL1560954",
          "CHEMBL1561080",
          "CHEMBL1561089",
          "CHEMBL1561150",
          "CHEMBL1561240",
          "CHEMBL1561287",
          "CHEMBL1562044",
          "CHEMBL1562277",
          "CHEMBL1562304",
          "CHEMBL1562493",
          "CHEMBL1562575",
          "CHEMBL1562647",
          "CHEMBL1562986",
          "CHEMBL1563483",
          "CHEMBL1563911",
          "CHEMBL1564136",
          "CHEMBL1564569",
          "CHEMBL1564660",
          "CHEMBL1565040",
          "CHEMBL1565496",
          "CHEMBL1565993",
          "CHEMBL1566334",
          "CHEMBL1566829",
          "CHEMBL1566847",
          "CHEMBL1566903",
          "CHEMBL1567008",
          "CHEMBL1567177",
          "CHEMBL1567274",
          "CHEMBL1567389",
          "CHEMBL1567571",
          "CHEMBL1567593",
          "CHEMBL1568747",
          "CHEMBL1569192",
          "CHEMBL1569585",
          "CHEMBL1569824",
          "CHEMBL1570216",
          "CHEMBL1570338",
          "CHEMBL1570857",
          "CHEMBL1570874",
          "CHEMBL1571615",
          "CHEMBL1572006",
          "CHEMBL1572026",
          "CHEMBL1572119",
          "CHEMBL1572266",
          "CHEMBL1572967",
          "CHEMBL1573267",
          "CHEMBL1573909",
          "CHEMBL1573994",
          "CHEMBL1574908",
          "CHEMBL1575594",
          "CHEMBL1576094",
          "CHEMBL1576110",
          "CHEMBL1576289",
          "CHEMBL1576787",
          "CHEMBL1576870",
          "CHEMBL1577081",
          "CHEMBL1577639",
          "CHEMBL1578101",
          "CHEMBL1578503",
          "CHEMBL1578584",
          "CHEMBL1578591",
          "CHEMBL1579803",
          "CHEMBL1580520",
          "CHEMBL1580532",
          "CHEMBL1580910",
          "CHEMBL1580927",
          "CHEMBL1581024",
          "CHEMBL1581696",
          "CHEMBL1581932",
          "CHEMBL1582152",
          "CHEMBL1582271",
          "CHEMBL1582448",
          "CHEMBL1582580",
          "CHEMBL1582868",
          "CHEMBL1583137",
          "CHEMBL1583461",
          "CHEMBL1583552",
          "CHEMBL1583691",
          "CHEMBL1584002",
          "CHEMBL1584796",
          "CHEMBL1584933",
          "CHEMBL1585165",
          "CHEMBL1585404",
          "CHEMBL1585473",
          "CHEMBL1585480",
          "CHEMBL1586169",
          "CHEMBL1586263",
          "CHEMBL1586274",
          "CHEMBL1586425",
          "CHEMBL1586432",
          "CHEMBL1586531",
          "CHEMBL1586817",
          "CHEMBL1587373",
          "CHEMBL1587592",
          "CHEMBL1587837",
          "CHEMBL1588356",
          "CHEMBL1588525",
          "CHEMBL1588660",
          "CHEMBL1589526",
          "CHEMBL1589652",
          "CHEMBL1594232",
          "CHEMBL1594604",
          "CHEMBL1594720",
          "CHEMBL1595015",
          "CHEMBL1595864",
          "CHEMBL1596234",
          "CHEMBL1596373",
          "CHEMBL1596965",
          "CHEMBL1597032",
          "CHEMBL1597042",
          "CHEMBL1597245",
          "CHEMBL1598287",
          "CHEMBL1598694",
          "CHEMBL1598843",
          "CHEMBL1599101",
          "CHEMBL1600073",
          "CHEMBL1600577",
          "CHEMBL1600882",
          "CHEMBL1601712",
          "CHEMBL1601788",
          "CHEMBL1602025",
          "CHEMBL1602157",
          "CHEMBL1602192",
          "CHEMBL1602581",
          "CHEMBL1602759",
          "CHEMBL1603410",
          "CHEMBL1603547",
          "CHEMBL1603615",
          "CHEMBL1603878",
          "CHEMBL1604527",
          "CHEMBL1605094",
          "CHEMBL1606747",
          "CHEMBL1606938",
          "CHEMBL1607086",
          "CHEMBL1607568",
          "CHEMBL1607895",
          "CHEMBL1607896",
          "CHEMBL1608078",
          "CHEMBL1608347",
          "CHEMBL1609491",
          "CHEMBL1610049",
          "CHEMBL1610756",
          "CHEMBL1611013",
          "CHEMBL1611733",
          "CHEMBL1612558",
          "CHEMBL1613452",
          "CHEMBL1613463",
          "CHEMBL1613615",
          "CHEMBL1613636",
          "CHEMBL1613695",
          "CHEMBL17157",
          "CHEMBL1731165",
          "CHEMBL1732236",
          "CHEMBL1885024",
          "CHEMBL1964338",
          "CHEMBL1968732",
          "CHEMBL1969593",
          "CHEMBL1971234",
          "CHEMBL1971875",
          "CHEMBL1972750",
          "CHEMBL1973525",
          "CHEMBL1973629",
          "CHEMBL1974389",
          "CHEMBL1976225",
          "CHEMBL1976507",
          "CHEMBL1977082",
          "CHEMBL1980308",
          "CHEMBL1981103",
          "CHEMBL1982010",
          "CHEMBL1984130",
          "CHEMBL1984247",
          "CHEMBL1984336",
          "CHEMBL1985061",
          "CHEMBL1986259",
          "CHEMBL1988416",
          "CHEMBL1988798",
          "CHEMBL1989225",
          "CHEMBL1989704",
          "CHEMBL1990510",
          "CHEMBL1990598",
          "CHEMBL1991215",
          "CHEMBL1994372",
          "CHEMBL1994838",
          "CHEMBL19954",
          "CHEMBL2000338",
          "CHEMBL2000517",
          "CHEMBL2001895",
          "CHEMBL2003943",
          "CHEMBL2004918",
          "CHEMBL2005602",
          "CHEMBL2006154",
          "CHEMBL2006503",
          "CHEMBL2006634",
          "CHEMBL259018",
          "CHEMBL259784",
          "CHEMBL261693",
          "CHEMBL300389",
          "CHEMBL338474",
          "CHEMBL394242",
          "CHEMBL414890",
          "CHEMBL417727",
          "CHEMBL421701",
          "CHEMBL433680",
          "CHEMBL454580",
          "CHEMBL46516",
          "CHEMBL466853",
          "CHEMBL486196",
          "CHEMBL494255",
          "CHEMBL496633",
          "CHEMBL498373",
          "CHEMBL518292",
          "CHEMBL523200",
          "CHEMBL524222",
          "CHEMBL528181",
          "CHEMBL567422",
          "CHEMBL570399",
          "CHEMBL570400",
          "CHEMBL582081",
          "CHEMBL584269",
          "CHEMBL584458",
          "CHEMBL597251",
          "CHEMBL601952",
          "CHEMBL607299",
          "CHEMBL607309",
          "CHEMBL610198",
          "CHEMBL69612"
        ],
        "number_of_missing_values": "0"
      },
      {
        "data_type": "numeric",
        "index": "1",
        "is_ignore": "false",
        "is_row_identifier": "false",
        "is_target": "false",
        "name": "CATS2D_06_DL",
        "number_of_missing_values": "0"
      },
      {
        "data_type": "numeric",
        "index": "2",
        "is_ignore": "false",
        "is_row_identifier": "false",
        "is_target": "false",
        "name": "HNar",
        "number_of_missing_values": "0"
      },
      {
        "data_type": "numeric",
        "index": "3",
        "is_ignore": "false",
        "is_row_identifier": "false",
        "is_target": "false",
        "name": "GNar",
        "number_of_missing_values": "0"
      },
      {
        "data_type": "numeric",
        "index": "4",
        "is_ignore": "false",
        "is_row_identifier": "false",
        "is_target": "false",
        "name": "X0A",
        "number_of_missing_values": "0"
      },
      {
        "data_type": "numeric",
        "index": "5",
        "is_ignore": "false",
        "is_row_identifier": "false",
        "is_target": "false",
        "name": "P_VSA_e_3",
        "number_of_missing_values": "0"
      },
      {
        "data_type": "numeric",
        "index": "6",
        "is_ignore": "false",
        "is_row_identifier": "false",
        "is_target": "false",
        "name": "SaasC",
        "number_of_missing_values": "0"
      },
      {
        "data_type": "numeric",
        "index": "7",
        "is_ignore": "false",
        "is_row_identifier": "false",
        "is_target": "false",
        "name": "P_VSA_p_2",
        "number_of_missing_values": "0"
      },
      {
        "data_type": "numeric",
        "index": "8",
        "is_ignore": "false",
        "is_row_identifier": "false",
        "is_target": "false",
        "name": "P_VSA_m_2",
        "number_of_missing_values": "0"
      },
      {
        "data_type": "numeric",
        "index": "9",
        "is_ignore": "false",
        "is_row_identifier": "false",
        "is_target": "false",
        "name": "TPSA.NO.",
        "number_of_missing_values": "0"
      },
      {
        "data_type": "numeric",
        "index": "10",
        "is_ignore": "false",
        "is_row_identifier": "false",
        "is_target": "false",
        "name": "MAXDP",
        "number_of_missing_values": "0"
      },
      {
        "data_type": "numeric",
        "index": "11",
        "is_ignore": "false",
        "is_row_identifier": "false",
        "is_target": "false",
        "name": "AAC",
        "number_of_missing_values": "0"
      },
      {
        "data_type": "numeric",
        "index": "12",
        "is_ignore": "false",
        "is_row_identifier": "false",
        "is_target": "false",
        "name": "AECC",
        "number_of_missing_values": "0"
      },
      {
        "data_type": "numeric",
        "index": "13",
        "is_ignore": "false",
        "is_row_identifier": "false",
        "is_target": "false",
        "name": "ALOGP",
        "number_of_missing_values": "0"
      },
      {
        "data_type": "numeric",
        "index": "14",
        "is_ignore": "false",
        "is_row_identifier": "false",
        "is_target": "false",
        "name": "ALOGP2",
        "number_of_missing_values": "0"
      },
      {
        "data_type": "numeric",
        "index": "15",
        "is_ignore": "false",
        "is_row_identifier": "false",
        "is_target": "false",
        "name": "AMR",
        "number_of_missing_values": "0"
      },
      {
        "data_type": "numeric",
        "index": "16",
        "is_ignore": "false",
        "is_row_identifier": "false",
        "is_target": "false",
        "name": "AMW",
        "number_of_missing_values": "0"
      },
      {
        "data_type": "numeric",
        "index": "17",
        "is_ignore": "false",
        "is_row_identifier": "false",
        "is_target": "false",
        "name": "ARR",
        "number_of_missing_values": "0"
      },
      {
        "data_type": "numeric",
        "index": "18",
        "is_ignore": "false",
        "is_row_identifier": "false",
        "is_target": "false",
        "name": "ATS1e",
        "number_of_missing_values": "0"
      },
      {
        "data_type": "numeric",
        "index": "19",
        "is_ignore": "false",
        "is_row_identifier": "false",
        "is_target": "false",
        "name": "ATS1i",
        "number_of_missing_values": "0"
      },
      {
        "data_type": "numeric",
        "index": "20",
        "is_ignore": "false",
        "is_row_identifier": "false",
        "is_target": "false",
        "name": "ATS1m",
        "number_of_missing_values": "0"
      },
      {
        "data_type": "numeric",
        "index": "21",
        "is_ignore": "false",
        "is_row_identifier": "false",
        "is_target": "false",
        "name": "ATS1p",
        "number_of_missing_values": "0"
      },
      {
        "data_type": "numeric",
        "index": "22",
        "is_ignore": "false",
        "is_row_identifier": "false",
        "is_target": "false",
        "name": "ATS1s",
        "number_of_missing_values": "0"
      },
      {
        "data_type": "numeric",
        "index": "23",
        "is_ignore": "false",
        "is_row_identifier": "false",
        "is_target": "false",
        "name": "ATS1v",
        "number_of_missing_values": "0"
      },
      {
        "data_type": "numeric",
        "index": "24",
        "is_ignore": "false",
        "is_row_identifier": "false",
        "is_target": "false",
        "name": "ATS2e",
        "number_of_missing_values": "0"
      },
      {
        "data_type": "numeric",
        "index": "25",
        "is_ignore": "false",
        "is_row_identifier": "false",
        "is_target": "false",
        "name": "ATS2i",
        "number_of_missing_values": "0"
      },
      {
        "data_type": "numeric",
        "index": "26",
        "is_ignore": "false",
        "is_row_identifier": "false",
        "is_target": "false",
        "name": "ATS2m",
        "number_of_missing_values": "0"
      },
      {
        "data_type": "numeric",
        "index": "27",
        "is_ignore": "false",
        "is_row_identifier": "false",
        "is_target": "false",
        "name": "ATS2p",
        "number_of_missing_values": "0"
      },
      {
        "data_type": "numeric",
        "index": "28",
        "is_ignore": "false",
        "is_row_identifier": "false",
        "is_target": "false",
        "name": "ATS2s",
        "number_of_missing_values": "0"
      },
      {
        "data_type": "numeric",
        "index": "29",
        "is_ignore": "false",
        "is_row_identifier": "false",
        "is_target": "false",
        "name": "ATS2v",
        "number_of_missing_values": "0"
      },
      {
        "data_type": "numeric",
        "index": "30",
        "is_ignore": "false",
        "is_row_identifier": "false",
        "is_target": "false",
        "name": "ATS3e",
        "number_of_missing_values": "0"
      },
      {
        "data_type": "numeric",
        "index": "31",
        "is_ignore": "false",
        "is_row_identifier": "false",
        "is_target": "false",
        "name": "ATS3i",
        "number_of_missing_values": "0"
      },
      {
        "data_type": "numeric",
        "index": "32",
        "is_ignore": "false",
        "is_row_identifier": "false",
        "is_target": "false",
        "name": "ATS3m",
        "number_of_missing_values": "0"
      },
      {
        "data_type": "numeric",
        "index": "33",
        "is_ignore": "false",
        "is_row_identifier": "false",
        "is_target": "false",
        "name": "ATS3p",
        "number_of_missing_values": "0"
      },
      {
        "data_type": "numeric",
        "index": "34",
        "is_ignore": "false",
        "is_row_identifier": "false",
        "is_target": "false",
        "name": "ATS3s",
        "number_of_missing_values": "0"
      },
      {
        "data_type": "numeric",
        "index": "35",
        "is_ignore": "false",
        "is_row_identifier": "false",
        "is_target": "false",
        "name": "ATS3v",
        "number_of_missing_values": "0"
      },
      {
        "data_type": "numeric",
        "index": "36",
        "is_ignore": "false",
        "is_row_identifier": "false",
        "is_target": "false",
        "name": "ATS4e",
        "number_of_missing_values": "0"
      },
      {
        "data_type": "numeric",
        "index": "37",
        "is_ignore": "false",
        "is_row_identifier": "false",
        "is_target": "false",
        "name": "ATS4i",
        "number_of_missing_values": "0"
      },
      {
        "data_type": "numeric",
        "index": "38",
        "is_ignore": "false",
        "is_row_identifier": "false",
        "is_target": "false",
        "name": "ATS4m",
        "number_of_missing_values": "0"
      },
      {
        "data_type": "numeric",
        "index": "39",
        "is_ignore": "false",
        "is_row_identifier": "false",
        "is_target": "false",
        "name": "ATS4p",
        "number_of_missing_values": "0"
      },
      {
        "data_type": "numeric",
        "index": "40",
        "is_ignore": "false",
        "is_row_identifier": "false",
        "is_target": "false",
        "name": "ATS4s",
        "number_of_missing_values": "0"
      },
      {
        "data_type": "numeric",
        "index": "41",
        "is_ignore": "false",
        "is_row_identifier": "false",
        "is_target": "false",
        "name": "ATS4v",
        "number_of_missing_values": "0"
      },
      {
        "data_type": "numeric",
        "index": "42",
        "is_ignore": "false",
        "is_row_identifier": "false",
        "is_target": "false",
        "name": "ATS5e",
        "number_of_missing_values": "0"
      },
      {
        "data_type": "numeric",
        "index": "43",
        "is_ignore": "false",
        "is_row_identifier": "false",
        "is_target": "false",
        "name": "ATS5i",
        "number_of_missing_values": "0"
      },
      {
        "data_type": "numeric",
        "index": "44",
        "is_ignore": "false",
        "is_row_identifier": "false",
        "is_target": "false",
        "name": "ATS5m",
        "number_of_missing_values": "0"
      },
      {
        "data_type": "numeric",
        "index": "45",
        "is_ignore": "false",
        "is_row_identifier": "false",
        "is_target": "false",
        "name": "ATS5p",
        "number_of_missing_values": "0"
      },
      {
        "data_type": "numeric",
        "index": "46",
        "is_ignore": "false",
        "is_row_identifier": "false",
        "is_target": "false",
        "name": "ATS5s",
        "number_of_missing_values": "0"
      },
      {
        "data_type": "numeric",
        "index": "47",
        "is_ignore": "false",
        "is_row_identifier": "false",
        "is_target": "false",
        "name": "ATS5v",
        "number_of_missing_values": "0"
      },
      {
        "data_type": "numeric",
        "index": "48",
        "is_ignore": "false",
        "is_row_identifier": "false",
        "is_target": "false",
        "name": "ATS6e",
        "number_of_missing_values": "0"
      },
      {
        "data_type": "numeric",
        "index": "49",
        "is_ignore": "false",
        "is_row_identifier": "false",
        "is_target": "false",
        "name": "ATS6i",
        "number_of_missing_values": "0"
      },
      {
        "data_type": "numeric",
        "index": "50",
        "is_ignore": "false",
        "is_row_identifier": "false",
        "is_target": "false",
        "name": "ATS6m",
        "number_of_missing_values": "0"
      },
      {
        "data_type": "numeric",
        "index": "51",
        "is_ignore": "false",
        "is_row_identifier": "false",
        "is_target": "false",
        "name": "ATS6p",
        "number_of_missing_values": "0"
      },
      {
        "data_type": "numeric",
        "index": "52",
        "is_ignore": "false",
        "is_row_identifier": "false",
        "is_target": "false",
        "name": "ATS6s",
        "number_of_missing_values": "0"
      },
      {
        "data_type": "numeric",
        "index": "53",
        "is_ignore": "false",
        "is_row_identifier": "false",
        "is_target": "false",
        "name": "ATS6v",
        "number_of_missing_values": "0"
      },
      {
        "data_type": "numeric",
        "index": "54",
        "is_ignore": "false",
        "is_row_identifier": "false",
        "is_target": "false",
        "name": "ATS7e",
        "number_of_missing_values": "0"
      },
      {
        "data_type": "numeric",
        "index": "55",
        "is_ignore": "false",
        "is_row_identifier": "false",
        "is_target": "false",
        "name": "ATS7i",
        "number_of_missing_values": "0"
      },
      {
        "data_type": "numeric",
        "index": "56",
        "is_ignore": "false",
        "is_row_identifier": "false",
        "is_target": "false",
        "name": "ATS7m",
        "number_of_missing_values": "0"
      },
      {
        "data_type": "numeric",
        "index": "57",
        "is_ignore": "false",
        "is_row_identifier": "false",
        "is_target": "false",
        "name": "ATS7p",
        "number_of_missing_values": "0"
      },
      {
        "data_type": "numeric",
        "index": "58",
        "is_ignore": "false",
        "is_row_identifier": "false",
        "is_target": "false",
        "name": "ATS7s",
        "number_of_missing_values": "0"
      },
      {
        "data_type": "numeric",
        "index": "59",
        "is_ignore": "false",
        "is_row_identifier": "false",
        "is_target": "false",
        "name": "ATS7v",
        "number_of_missing_values": "0"
      },
      {
        "data_type": "numeric",
        "index": "60",
        "is_ignore": "false",
        "is_row_identifier": "false",
        "is_target": "false",
        "name": "ATS8e",
        "number_of_missing_values": "0"
      },
      {
        "data_type": "numeric",
        "index": "61",
        "is_ignore": "false",
        "is_row_identifier": "false",
        "is_target": "false",
        "name": "ATS8i",
        "number_of_missing_values": "0"
      },
      {
        "data_type": "numeric",
        "index": "62",
        "is_ignore": "false",
        "is_row_identifier": "false",
        "is_target": "false",
        "name": "ATS8m",
        "number_of_missing_values": "0"
      },
      {
        "data_type": "numeric",
        "index": "63",
        "is_ignore": "false",
        "is_row_identifier": "false",
        "is_target": "false",
        "name": "ATS8p",
        "number_of_missing_values": "0"
      },
      {
        "data_type": "numeric",
        "index": "64",
        "is_ignore": "false",
        "is_row_identifier": "false",
        "is_target": "false",
        "name": "ATS8s",
        "number_of_missing_values": "0"
      },
      {
        "data_type": "numeric",
        "index": "65",
        "is_ignore": "false",
        "is_row_identifier": "false",
        "is_target": "false",
        "name": "ATS8v",
        "number_of_missing_values": "0"
      },
      {
        "data_type": "numeric",
        "index": "66",
        "is_ignore": "false",
        "is_row_identifier": "false",
        "is_target": "false",
        "name": "ATSC1e",
        "number_of_missing_values": "0"
      },
      {
        "data_type": "numeric",
        "index": "67",
        "is_ignore": "false",
        "is_row_identifier": "false",
        "is_target": "false",
        "name": "ATSC1i",
        "number_of_missing_values": "0"
      },
      {
        "data_type": "numeric",
        "index": "68",
        "is_ignore": "false",
        "is_row_identifier": "false",
        "is_target": "false",
        "name": "ATSC1m",
        "number_of_missing_values": "0"
      },
      {
        "data_type": "numeric",
        "index": "69",
        "is_ignore": "false",
        "is_row_identifier": "false",
        "is_target": "false",
        "name": "ATSC1p",
        "number_of_missing_values": "0"
      },
      {
        "data_type": "numeric",
        "index": "70",
        "is_ignore": "false",
        "is_row_identifier": "false",
        "is_target": "false",
        "name": "ATSC1s",
        "number_of_missing_values": "0"
      },
      {
        "data_type": "numeric",
        "index": "71",
        "is_ignore": "false",
        "is_row_identifier": "false",
        "is_target": "true",
        "name": "pXC50",
        "number_of_missing_values": "0"
      }
    ]
  }
}