"molecule_id","AMW","H.","pXC50"
{1 6.601,2 51,3 6.478}
{0 CHEMBL104571,1 6.87,2 48.8,3 6.215}
{0 CHEMBL104772,1 7.034,2 47.5,3 6.873}
{0 CHEMBL106116,1 7.034,2 47.5,3 6.821}
{0 CHEMBL106801,1 7.457,2 44.7,3 6.886}
{0 CHEMBL106836,1 7.457,2 44.7,3 6.83}
{0 CHEMBL1090,1 8.353,2 40.6,3 4.086}
{0 CHEMBL1229920,1 8.686,2 38.7,3 5.337}
{0 CHEMBL13078,1 7.255,2 45.3,3 6.561}
{0 CHEMBL183,1 6.618,2 52.2,3 9.328}
{0 CHEMBL2079578,1 8.442,2 40,3 4}
{0 CHEMBL2079579,1 9.042,2 36.7,3 4.538}
{0 CHEMBL25856,1 7.226,2 45.9,3 6.851}
{0 CHEMBL274833,1 7.117,2 46.4,3 6.432}
{0 CHEMBL279654,1 8.686,2 38.7,3 4}
{0 CHEMBL282503,1 7.843,2 43.3,3 5.553}
{0 CHEMBL299161,1 6.727,2 50,3 8}
{0 CHEMBL318338,1 6.601,2 51,3 8}
{0 CHEMBL319707,1 7.034,2 47.5,3 6.943}
{0 CHEMBL320428,1 7.307,2 44.7,3 8}
{0 CHEMBL416340,1 8.106,2 41.9,3 4.824}
{0 CHEMBL431950,1 7.856,2 43.1,3 5.523}
{0 CHEMBL61448,1 8.029,2 41.8,3 5.959}
