"molecule_id","nCsp","nTB","nDB","C.","pXC50"
{1 1,2 1,3 1,4 44.9,5 4.387}
{0 CHEMBL100566,1 1,2 1,3 1,4 46.3,5 4.699}
{0 CHEMBL100579,1 1,2 1,3 1,4 44.2,5 4.337}
{0 CHEMBL100640,1 1,2 1,3 1,4 43.6,5 4.509}
{0 CHEMBL100661,1 1,2 1,3 2,4 39.7,5 5.569}
{0 CHEMBL100798,1 1,2 1,3 1,4 40.8,5 4.921}
{0 CHEMBL101106,1 1,2 1,3 1,4 41.8,5 4.301}
{0 CHEMBL101467,1 1,2 1,3 1,4 44.2,5 4.721}
{0 CHEMBL101509,1 1,2 1,3 1,4 42.3,5 4.301}
{0 CHEMBL101561,1 1,2 1,3 1,4 44.9,5 4.959}
{0 CHEMBL101564,1 1,2 1,3 1,4 44.2,5 4.721}
{0 CHEMBL101708,1 1,2 1,3 1,4 46.2,5 4.699}
{0 CHEMBL101788,1 1,2 1,3 1,4 40.3,5 4.301}
{0 CHEMBL101978,1 1,2 1,3 1,4 44.2,5 4.796}
{0 CHEMBL102031,1 1,2 1,3 1,4 43.8,5 4.444}
{0 CHEMBL102107,1 1,2 1,3 1,4 43.1,5 5.553}
{0 CHEMBL22702,1 4,2 3,4 51.9,5 5.387}
{0 CHEMBL22703,1 2,2 2,4 48.3,5 6.06}
{0 CHEMBL23370,1 3,2 2,4 52.5,5 7.745}
{0 CHEMBL23578,1 4,2 3,4 54,5 5.959}
{0 CHEMBL23753,1 3,2 2,4 52.6,5 7.398}
{0 CHEMBL24043,1 4,2 3,4 50.9,5 5.62}
{0 CHEMBL24048,1 3,2 2,4 50,5 6.444}
{0 CHEMBL24123,1 4,2 3,4 51.9,5 6.367}
{0 CHEMBL24159,1 4,2 3,4 54.5,5 4.081}
{0 CHEMBL24271,1 3,2 2,4 54.5,5 8.509}
{0 CHEMBL24554,1 5,2 3,4 56.1,5 7.796}
{0 CHEMBL24733,1 4,2 3,4 55.4,5 8}
{0 CHEMBL24822,1 3,2 2,4 51.9,5 6.62}
{0 CHEMBL25620,1 4,2 3,4 52.8,5 5.252}
{0 CHEMBL25621,1 2,2 2,4 51,5 5.921}
{0 CHEMBL26068,1 3,2 2,4 50.9,5 6.131}
{0 CHEMBL26492,1 1,2 1,4 48.2,5 5.745}
{0 CHEMBL26511,1 3,2 2,3 1,4 47.8,5 5}
{0 CHEMBL277646,1 3,2 2,4 53.1,5 7}
{0 CHEMBL282349,1 4,2 3,4 52.8,5 6.678}
{0 CHEMBL283051,1 3,2 2,4 54.5,5 8.022}
{0 CHEMBL287729,1 2,2 2,4 51.8,5 8}
{0 CHEMBL288046,1 2,2 2,4 50,5 5.553}
{0 CHEMBL288449,1 2,2 2,4 49.1,5 8}
{0 CHEMBL288523,1 2,2 2,4 50,5 5.959}
{0 CHEMBL288838,1 2,2 2,4 50,5 8}
{0 CHEMBL288901,1 2,2 2,3 1,4 44.9,5 5.678}
{0 CHEMBL289844,1 2,2 2,4 50,5 6.018}
{0 CHEMBL290161,1 2,2 2,4 43.4,5 8}
{0 CHEMBL290760,1 2,2 2,4 44.8,5 5.62}
{0 CHEMBL312137,1 1,2 1,3 1,4 44.2,5 5.469}
{0 CHEMBL316502,1 1,2 1,3 1,4 44.2,5 4.398}
{0 CHEMBL316726,1 1,2 1,3 1,4 45.1,5 5.187}
{0 CHEMBL317129,1 1,2 1,3 1,4 42.6,5 4.301}
{0 CHEMBL317520,1 1,2 1,3 1,4 44.2,5 4.959}
{0 CHEMBL317747,1 1,2 1,3 1,4 43.1,5 5.824}
{0 CHEMBL318438,1 1,2 1,3 1,4 44.2,5 4.959}
{0 CHEMBL318943,1 1,2 1,3 1,4 45.6,5 4.824}
{0 CHEMBL319737,1 1,2 1,3 1,4 41.8,5 4.553}
{0 CHEMBL322007,1 1,2 1,3 1,4 41.3,5 4.301}
{0 CHEMBL327278,1 1,2 1,3 1,4 46.6,5 6.056}
{0 CHEMBL327500,1 1,2 1,3 1,4 44.2,5 4.824}
{0 CHEMBL327506,1 1,2 1,3 1,4 44.2,5 4.62}
{0 CHEMBL327946,1 1,2 1,3 1,4 45.3,5 4.301}
{0 CHEMBL329067,1 1,2 1,3 1,4 45.1,5 4.921}
{0 CHEMBL37194,1 2,2 2,4 48.1,5 6.292}
{0 CHEMBL38438,1 2,2 2,4 50,5 5.77}
{0 CHEMBL38567,1 2,2 2,4 50,5 5.796}
{0 CHEMBL38595,1 2,2 2,4 51.8,5 6.987}
{0 CHEMBL38615,1 2,2 2,4 48.1,5 6.004}
{0 CHEMBL38616,1 2,2 2,4 50,5 5.064}
{0 CHEMBL38941,1 2,2 2,4 45.5,5 6.081}
{0 CHEMBL38974,1 2,2 2,4 51.8,5 5.585}
{0 CHEMBL39096,1 2,2 2,4 48.1,5 5.921}
{0 CHEMBL39117,1 2,2 2,4 50,5 5.377}
{0 CHEMBL39805,1 2,2 2,3 1,4 44.9,5 5.678}
{0 CHEMBL41268,1 2,2 2,4 50,5 5.854}
{0 CHEMBL41454,1 2,2 2,4 50,5 8}
{0 CHEMBL41515,1 2,2 2,4 51.8,5 5.26}
{0 CHEMBL41518,1 2,2 2,3 1,4 40.6,5 7.377}
{0 CHEMBL41540,1 2,2 2,4 50,5 8}
{0 CHEMBL41682,1 2,2 2,4 50,5 5.066}
{0 CHEMBL418018,1 3,2 2,4 52.6,5 7.036}
{0 CHEMBL418059,1 2,2 2,4 50,5 5.409}
{0 CHEMBL418982,1 1,2 1,3 1,4 44.2,5 4.854}
{0 CHEMBL41936,1 2,2 2,3 1,4 43,5 6.187}
{0 CHEMBL41951,1 2,2 2,4 49.1,5 5.959}
{0 CHEMBL420833,1 1,2 1,3 1,4 43.6,5 4.319}
{0 CHEMBL430478,1 1,2 1,3 1,4 42.3,5 4.301}
{0 CHEMBL43082,1 2,2 2,4 50,5 5.319}
{0 CHEMBL432477,1 2,2 2,4 48.1,5 8}
{0 CHEMBL434396,1 2,2 2,4 46,5 5.745}
{0 CHEMBL43455,1 2,2 2,4 49.1,5 5.409}
{0 CHEMBL43631,1 2,2 2,4 51.8,5 7.62}
{0 CHEMBL97925,1 1,2 1,3 1,4 44.9,5 4.337}
{0 CHEMBL97973,1 1,2 1,3 1,4 43.6,5 4.959}
{0 CHEMBL98147,1 1,2 1,3 1,4 41.3,5 4.301}
{0 CHEMBL98314,1 1,2 1,3 1,4 43.6,5 5.131}
{0 CHEMBL98553,1 1,2 1,3 2,4 39.7,5 5.444}
{0 CHEMBL98711,1 1,2 1,3 1,4 44.6,5 5.337}
{0 CHEMBL98974,1 1,2 1,3 1,4 43.1,5 4.387}
{0 CHEMBL99205,1 1,2 1,3 1,4 44.9,5 5.187}
{0 CHEMBL99323,1 1,2 1,3 1,4 41.5,5 4.301}
{0 CHEMBL99371,1 1,2 1,3 1,4 43.8,5 4.699}
{0 CHEMBL99381,1 1,2 1,3 1,4 44.9,5 4.377}
{0 CHEMBL99435,1 1,2 1,3 1,4 43.8,5 4.699}
{0 CHEMBL99650,1 1,2 1,3 1,4 43.1,5 4.301}
