"molecule_id","AMW","C.","H.","Me","Mi","Mp","Mv","MW","N.","pXC50"
{1 8.609,2 35.3,3 45.1,4 1.007,5 1.132,6 0.696,7 0.643,8 439.06,9 11.8,10 8.208}
{0 CHEMBL2349180,1 8.801,2 36,3 44,4 1.012,5 1.129,6 0.699,7 0.65,8 440.04,9 10,10 8.237}
{0 CHEMBL2349181,1 9.064,2 36.2,3 42.6,4 1.015,5 1.128,6 0.706,7 0.659,8 426.01,9 10.6,10 7.678}
{0 CHEMBL2349182,1 7.762,2 36.5,3 48.1,4 0.997,5 1.129,6 0.681,7 0.624,8 403.63,9 9.6,10 7.745}
{0 CHEMBL2349183,1 7.594,2 36.4,3 49.1,4 0.995,5 1.129,6 0.676,7 0.618,8 417.66,9 9.1,10 6.959}
{0 CHEMBL2349184,1 8.452,2 36,3 44,4 1.016,5 1.128,6 0.68,7 0.641,8 422.58,9 8,10 6.959}
{0 CHEMBL2349185,1 8.298,2 36.7,3 44.9,4 1.01,5 1.126,6 0.684,7 0.64,8 406.58,9 8.2,10 6.553}
{0 CHEMBL2349186,1 7.802,2 37.5,3 45.8,4 1.009,5 1.131,6 0.664,7 0.628,8 374.51,9 8.3,10 7.357}
{0 CHEMBL2349187,1 7.594,2 36.4,3 49.1,4 0.995,5 1.129,6 0.676,7 0.618,8 417.66,9 9.1,10 5.921}
{0 CHEMBL2349301,1 8.424,2 36.5,3 46.2,4 1.003,5 1.128,6 0.697,7 0.64,8 438.07,9 9.6,10 7.041}
{0 CHEMBL2349302,1 8.864,2 37.3,3 43.1,4 1.012,5 1.126,6 0.705,7 0.656,8 452.05,9 9.8,10 7.367}
{0 CHEMBL2349303,1 8.188,2 37.3,3 45.1,4 1.005,5 1.127,6 0.688,7 0.64,8 417.61,9 9.8,10 8.081}
{0 CHEMBL2349304,1 8.216,2 36.7,3 44.9,4 1.003,5 1.13,6 0.691,7 0.641,8 402.6,9 12.2,10 6.658}
{0 CHEMBL2349305,1 8.408,2 37.5,3 43.8,4 1.008,5 1.126,6 0.694,7 0.648,8 403.58,9 10.4,10 6.495}
{0 CHEMBL2349306,1 8.887,2 37.5,3 41.7,4 1.025,5 1.139,6 0.687,7 0.654,8 426.56,9 8.3,10 8}
{0 CHEMBL2349307,1 8.137,2 35.4,3 45.8,4 1.003,5 1.133,6 0.685,7 0.634,8 390.59,9 12.5,10 6.444}
{0 CHEMBL2349308,1 8.137,2 35.4,3 45.8,4 1.003,5 1.133,6 0.685,7 0.634,8 390.59,9 12.5,10 6.174}
{0 CHEMBL2349309,1 8.137,2 35.4,3 45.8,4 1.003,5 1.133,6 0.685,7 0.634,8 390.59,9 12.5,10 6.046}
{0 CHEMBL2349310,1 7.762,2 36.5,3 48.1,4 0.997,5 1.129,6 0.681,7 0.624,8 403.63,9 9.6,10 8.409}
{0 CHEMBL2349311,1 7.762,2 36.5,3 48.1,4 0.997,5 1.129,6 0.681,7 0.624,8 403.63,9 9.6,10 7.745}
{0 CHEMBL2349312,1 7.934,2 37.3,3 47.1,4 1.001,5 1.126,6 0.683,7 0.631,8 404.61,9 7.8,10 8.108}
{0 CHEMBL2349313,1 7.934,2 37.3,3 47.1,4 1.001,5 1.126,6 0.683,7 0.631,8 404.61,9 7.8,10 8.097}
{0 CHEMBL2349314,1 9.279,2 36.5,3 46.2,4 1.001,5 1.126,6 0.707,7 0.644,8 482.52,9 9.6,10 7.886}
{0 CHEMBL2349315,1 9.279,2 36.5,3 46.2,4 1.001,5 1.126,6 0.707,7 0.644,8 482.52,9 9.6,10 6.991}
{0 CHEMBL2349316,1 8.108,2 36.5,3 46.2,4 1.006,5 1.135,6 0.679,7 0.632,8 421.62,9 9.6,10 8.328}
{0 CHEMBL2349317,1 8.292,2 38,3 44,4 1.003,5 1.127,6 0.698,7 0.649,8 414.61,9 12,10 7.377}
{0 CHEMBL2349318,1 8.481,2 38.8,3 42.9,4 1.008,5 1.124,6 0.7,7 0.656,8 415.59,9 10.2,10 7.854}
{0 CHEMBL2349319,1 8.306,2 34.5,3 46.6,4 1.008,5 1.128,6 0.685,7 0.631,8 481.73,9 8.6,10 7.553}
{0 CHEMBL2349320,1 7.951,2 36.7,3 46.9,4 0.999,5 1.128,6 0.686,7 0.631,8 389.6,9 10.2,10 6.721}
{0 CHEMBL2349321,1 8.137,2 37.5,3 45.8,4 1.003,5 1.125,6 0.689,7 0.638,8 390.58,9 8.3,10 7.523}
{0 CHEMBL2349322,1 9.561,2 36.7,3 44.9,4 1.003,5 1.125,6 0.714,7 0.652,8 468.49,9 10.2,10 8.398}
{0 CHEMBL2349323,1 8.654,2 36.7,3 44.9,4 1.005,5 1.127,6 0.704,7 0.648,8 424.04,9 10.2,10 7.292}
{0 CHEMBL2349324,1 8.318,2 36.7,3 44.9,4 1.009,5 1.135,6 0.685,7 0.639,8 407.59,9 10.2,10 7.638}
{0 CHEMBL2349325,1 7.762,2 36.5,3 48.1,4 0.997,5 1.129,6 0.681,7 0.624,8 403.63,9 9.6,10 7.155}
{0 CHEMBL2349326,1 8.292,2 38,3 44,4 1.003,5 1.127,6 0.698,7 0.649,8 414.61,9 12,10 6.921}
{0 CHEMBL2349327,1 7.918,2 35.8,3 47.2,4 1.003,5 1.13,6 0.676,7 0.626,8 419.63,9 9.4,10 7.004}
{0 CHEMBL2349328,1 9.561,2 36.7,3 44.9,4 1.003,5 1.125,6 0.714,7 0.652,8 468.49,9 10.2,10 7.495}
{0 CHEMBL2349329,1 8.292,2 38,3 44,4 1.003,5 1.127,6 0.698,7 0.649,8 414.61,9 12,10 7.041}
{0 CHEMBL2349330,1 9.561,2 36.7,3 44.9,4 1.003,5 1.125,6 0.714,7 0.652,8 468.49,9 10.2,10 7.328}
{0 CHEMBL2349331,1 8.292,2 38,3 44,4 1.003,5 1.127,6 0.698,7 0.649,8 414.61,9 12,10 5.921}
{0 CHEMBL2349332,1 9.928,2 36.7,3 42.9,4 1.014,5 1.132,6 0.713,7 0.66,8 486.48,9 10.2,10 8.092}
{0 CHEMBL2349333,1 8.685,2 36.7,3 42.9,4 1.02,5 1.142,6 0.684,7 0.647,8 425.58,9 10.2,10 7.149}
{0 CHEMBL2349334,1 8.631,2 38.1,3 42.9,4 1.01,5 1.123,6 0.704,7 0.657,8 362.52,9 9.5,10 6.252}
{0 CHEMBL2349335,1 7.951,2 36.7,3 46.9,4 0.999,5 1.128,6 0.686,7 0.631,8 389.6,9 10.2,10 7.319}
{0 CHEMBL2349336,1 7.951,2 36.7,3 46.9,4 0.999,5 1.128,6 0.686,7 0.631,8 389.6,9 10.2,10 6.222}
{0 CHEMBL2349337,1 8.714,2 42.6,3 40.4,4 1.004,5 1.116,6 0.726,7 0.678,8 409.58,9 10.6,10 6.658}
{0 CHEMBL2349338,1 8.165,2 37,3 45.7,4 1.001,5 1.127,6 0.693,7 0.639,8 375.57,9 10.9,10 6.194}
{0 CHEMBL2349339,1 8.165,2 37,3 45.7,4 1.001,5 1.127,6 0.693,7 0.639,8 375.57,9 10.9,10 7}
{0 CHEMBL271013,1 8.688,2 37.5,3 42.5,4 1.007,5 1.126,6 0.709,7 0.659,8 347.51,9 12.5,10 5.959}
{0 CHEMBL274737,1 8.408,2 37.2,3 44.2,4 1.004,5 1.127,6 0.7,7 0.648,8 361.54,9 11.6,10 6.114}
{0 CHEMBL402986,1 8.936,2 38.5,3 41,4 1.013,5 1.122,6 0.713,7 0.668,8 348.49,9 10.3,10 4.538}
