{
  "data_set_description": {
    "collection_date": "November 2013",
    "creator": "Dr Jeremy Besnard, Dr Ivan Olier, Dr Noureddin Sadawi, Dr Larisa Soldatova, Dr Crina Grosan, Prof Ross King, Dr Richard Bickerton, Prof Andrew Hopkins and Dr Willem van Hoorn",
    "default_target_attribute": "pXC50",
    "description": "This dataset contains QSAR data (from ChEMBL version 17) showing activity values (unit is pseudo-pCI50) of several compounds on drug target ChEMBL_ID: CHEMBL1163104 (TID: 103433), and it has 73 rows and 43 features (not including molecule IDs and class feature: molecule_id and pXC50). The features represent Basic Molecular Descriptors which were generated from SMILES strings.  Missing value imputation was applied to this dataset (By choosing the Median).",
    "description_version": "1",
    "file_id": "3694061",
    "format": "ARFF",
    "id": "40356",
    "licence": "Public",
    "md5_checksum": "b7ccb63eeb4ac04489bce844dd02eaa1",
    "minio_url": "https://data.openml.org/datasets/0004/40356/dataset_40356.pq",
    "name": "QSAR-DATASET-FOR-DRUG-TARGET-CHEMBL1163104",
    "original_data_url": "https://www.ebi.ac.uk/chembl/target/inspect/CHEMBL1163104",
    "parquet_url": "https://data.openml.org/datasets/0004/40356/dataset_40356.pq",
    "processing_date": "2018-10-04 07:03:59",
    "row_id_attribute": "molecule_id",
    "status": "deactivated",
    "tag": [
      "MetaQSAR",
      "study_13"
    ],
    "upload_date": "2016-07-16T11:10:37",
    "url": "https://api.openml.org/data/v1/download/3694061/QSAR-DATASET-FOR-DRUG-TARGET-CHEMBL1163104.arff",
    "version": "12",
    "visibility": "public"
  }
}