{
  "data_features": {
    "feature": [
      {
        "data_type": "nominal",
        "index": "0",
        "is_ignore": "false",
        "is_row_identifier": "true",
        "is_target": "false",
        "name": "molecule_id",
        "nominal_value": [
          "CHEMBL1016",
          "CHEMBL112414",
          "CHEMBL112637",
          "CHEMBL113040",
          "CHEMBL113714",
          "CHEMBL114527",
          "CHEMBL114752",
          "CHEMBL114788",
          "CHEMBL115021",
          "CHEMBL115206",
          "CHEMBL115273",
          "CHEMBL115392",
          "CHEMBL115393",
          "CHEMBL115560",
          "CHEMBL115946",
          "CHEMBL116054",
          "CHEMBL116094",
          "CHEMBL116102",
          "CHEMBL121871",
          "CHEMBL123348",
          "CHEMBL123713",
          "CHEMBL124449",
          "CHEMBL128590",
          "CHEMBL128920",
          "CHEMBL129447",
          "CHEMBL132109",
          "CHEMBL142979",
          "CHEMBL143996",
          "CHEMBL144016",
          "CHEMBL144646",
          "CHEMBL144764",
          "CHEMBL144856",
          "CHEMBL145249",
          "CHEMBL146164",
          "CHEMBL1516",
          "CHEMBL191",
          "CHEMBL2058366",
          "CHEMBL2058367",
          "CHEMBL2058368",
          "CHEMBL2058369",
          "CHEMBL2058370",
          "CHEMBL2058371",
          "CHEMBL2058372",
          "CHEMBL2058373",
          "CHEMBL2058374",
          "CHEMBL2058375",
          "CHEMBL2058376",
          "CHEMBL2058377",
          "CHEMBL239378",
          "CHEMBL241523",
          "CHEMBL241529",
          "CHEMBL241684",
          "CHEMBL241685",
          "CHEMBL245444",
          "CHEMBL24550",
          "CHEMBL245644",
          "CHEMBL24646",
          "CHEMBL24842",
          "CHEMBL25226",
          "CHEMBL255111",
          "CHEMBL25989",
          "CHEMBL263471",
          "CHEMBL264230",
          "CHEMBL26449",
          "CHEMBL265681",
          "CHEMBL26875",
          "CHEMBL268804",
          "CHEMBL274447",
          "CHEMBL27511",
          "CHEMBL275875",
          "CHEMBL277003",
          "CHEMBL28160",
          "CHEMBL28162",
          "CHEMBL281887",
          "CHEMBL282082",
          "CHEMBL282566",
          "CHEMBL284546",
          "CHEMBL284877",
          "CHEMBL287374",
          "CHEMBL291502",
          "CHEMBL291689",
          "CHEMBL292316",
          "CHEMBL292412",
          "CHEMBL292430",
          "CHEMBL292781",
          "CHEMBL292914",
          "CHEMBL293001",
          "CHEMBL293308",
          "CHEMBL294075",
          "CHEMBL294140",
          "CHEMBL294358",
          "CHEMBL294485",
          "CHEMBL294598",
          "CHEMBL294992",
          "CHEMBL295174",
          "CHEMBL295279",
          "CHEMBL295369",
          "CHEMBL295514",
          "CHEMBL295529",
          "CHEMBL295532",
          "CHEMBL295695",
          "CHEMBL295905",
          "CHEMBL295959",
          "CHEMBL296173",
          "CHEMBL296518",
          "CHEMBL296519",
          "CHEMBL296719",
          "CHEMBL296731",
          "CHEMBL297425",
          "CHEMBL297583",
          "CHEMBL297714",
          "CHEMBL298509",
          "CHEMBL298560",
          "CHEMBL298836",
          "CHEMBL298943",
          "CHEMBL299151",
          "CHEMBL299269",
          "CHEMBL299391",
          "CHEMBL299770",
          "CHEMBL299809",
          "CHEMBL300105",
          "CHEMBL300186",
          "CHEMBL300279",
          "CHEMBL301325",
          "CHEMBL301479",
          "CHEMBL301547",
          "CHEMBL301569",
          "CHEMBL301827",
          "CHEMBL302127",
          "CHEMBL302520",
          "CHEMBL302811",
          "CHEMBL302815",
          "CHEMBL302973",
          "CHEMBL303170",
          "CHEMBL303247",
          "CHEMBL303264",
          "CHEMBL303822",
          "CHEMBL303907",
          "CHEMBL303955",
          "CHEMBL304032",
          "CHEMBL304251",
          "CHEMBL304360",
          "CHEMBL304772",
          "CHEMBL305032",
          "CHEMBL305190",
          "CHEMBL305350",
          "CHEMBL306486",
          "CHEMBL306670",
          "CHEMBL307128",
          "CHEMBL308424",
          "CHEMBL308651",
          "CHEMBL308884",
          "CHEMBL308911",
          "CHEMBL309084",
          "CHEMBL320135",
          "CHEMBL323819",
          "CHEMBL324729",
          "CHEMBL326086",
          "CHEMBL326400",
          "CHEMBL330866",
          "CHEMBL333155",
          "CHEMBL334838",
          "CHEMBL340612",
          "CHEMBL342553",
          "CHEMBL342726",
          "CHEMBL343249",
          "CHEMBL343439",
          "CHEMBL343840",
          "CHEMBL344093",
          "CHEMBL358121",
          "CHEMBL384349",
          "CHEMBL392118",
          "CHEMBL393305",
          "CHEMBL400424",
          "CHEMBL402669",
          "CHEMBL405031",
          "CHEMBL406519",
          "CHEMBL406888",
          "CHEMBL408033",
          "CHEMBL408098",
          "CHEMBL408403",
          "CHEMBL411624",
          "CHEMBL412717",
          "CHEMBL413098",
          "CHEMBL415157",
          "CHEMBL416296",
          "CHEMBL416507",
          "CHEMBL417366",
          "CHEMBL417410",
          "CHEMBL418269",
          "CHEMBL419762",
          "CHEMBL420551",
          "CHEMBL421094",
          "CHEMBL423021",
          "CHEMBL423930",
          "CHEMBL428475",
          "CHEMBL429847",
          "CHEMBL432128",
          "CHEMBL433099",
          "CHEMBL433278",
          "CHEMBL433895",
          "CHEMBL436192",
          "CHEMBL439743",
          "CHEMBL440051",
          "CHEMBL441649",
          "CHEMBL442251",
          "CHEMBL44526",
          "CHEMBL44605",
          "CHEMBL446314",
          "CHEMBL44690",
          "CHEMBL447182",
          "CHEMBL44749",
          "CHEMBL44798",
          "CHEMBL453934",
          "CHEMBL455286",
          "CHEMBL45766",
          "CHEMBL45805",
          "CHEMBL45864",
          "CHEMBL46361",
          "CHEMBL47177",
          "CHEMBL47583",
          "CHEMBL47817",
          "CHEMBL47872",
          "CHEMBL47873",
          "CHEMBL48242",
          "CHEMBL48459",
          "CHEMBL48602",
          "CHEMBL48934",
          "CHEMBL49170",
          "CHEMBL49192",
          "CHEMBL49207",
          "CHEMBL49262",
          "CHEMBL50092",
          "CHEMBL50592",
          "CHEMBL50906",
          "CHEMBL51001",
          "CHEMBL510065",
          "CHEMBL51078",
          "CHEMBL51084",
          "CHEMBL51606",
          "CHEMBL51622",
          "CHEMBL51689",
          "CHEMBL52046",
          "CHEMBL52601",
          "CHEMBL52700",
          "CHEMBL52791",
          "CHEMBL52824",
          "CHEMBL52880",
          "CHEMBL53174",
          "CHEMBL53226",
          "CHEMBL53244",
          "CHEMBL53322",
          "CHEMBL53631",
          "CHEMBL53803",
          "CHEMBL54699",
          "CHEMBL55366",
          "CHEMBL55507",
          "CHEMBL55939",
          "CHEMBL57090",
          "CHEMBL57242",
          "CHEMBL57781",
          "CHEMBL57783",
          "CHEMBL58938",
          "CHEMBL62269",
          "CHEMBL62314",
          "CHEMBL62936",
          "CHEMBL64670",
          "CHEMBL65224",
          "CHEMBL65503",
          "CHEMBL65955",
          "CHEMBL67636",
          "CHEMBL68370",
          "CHEMBL68494",
          "CHEMBL68516",
          "CHEMBL68597",
          "CHEMBL68622",
          "CHEMBL68713",
          "CHEMBL68732",
          "CHEMBL69025",
          "CHEMBL69124",
          "CHEMBL69144",
          "CHEMBL69154",
          "CHEMBL69221",
          "CHEMBL69236",
          "CHEMBL69475",
          "CHEMBL69522",
          "CHEMBL70074",
          "CHEMBL70134",
          "CHEMBL70239",
          "CHEMBL70242",
          "CHEMBL70947",
          "CHEMBL71038",
          "CHEMBL71254",
          "CHEMBL71384",
          "CHEMBL71410",
          "CHEMBL71545",
          "CHEMBL71550",
          "CHEMBL71954",
          "CHEMBL7550",
          "CHEMBL907",
          "CHEMBL995"
        ],
        "number_of_missing_values": "0"
      },
      {
        "data_type": "numeric",
        "index": "1",
        "is_ignore": "false",
        "is_row_identifier": "false",
        "is_target": "false",
        "name": "AMW",
        "number_of_missing_values": "0"
      },
      {
        "data_type": "numeric",
        "index": "2",
        "is_ignore": "false",
        "is_row_identifier": "false",
        "is_target": "false",
        "name": "C.",
        "number_of_missing_values": "0"
      },
      {
        "data_type": "numeric",
        "index": "3",
        "is_ignore": "false",
        "is_row_identifier": "false",
        "is_target": "false",
        "name": "H.",
        "number_of_missing_values": "0"
      },
      {
        "data_type": "numeric",
        "index": "4",
        "is_ignore": "false",
        "is_row_identifier": "false",
        "is_target": "false",
        "name": "Me",
        "number_of_missing_values": "0"
      },
      {
        "data_type": "numeric",
        "index": "5",
        "is_ignore": "false",
        "is_row_identifier": "false",
        "is_target": "false",
        "name": "Mi",
        "number_of_missing_values": "0"
      },
      {
        "data_type": "numeric",
        "index": "6",
        "is_ignore": "false",
        "is_row_identifier": "false",
        "is_target": "false",
        "name": "Mp",
        "number_of_missing_values": "0"
      },
      {
        "data_type": "numeric",
        "index": "7",
        "is_ignore": "false",
        "is_row_identifier": "false",
        "is_target": "false",
        "name": "Mv",
        "number_of_missing_values": "0"
      },
      {
        "data_type": "numeric",
        "index": "8",
        "is_ignore": "false",
        "is_row_identifier": "false",
        "is_target": "false",
        "name": "MW",
        "number_of_missing_values": "0"
      },
      {
        "data_type": "numeric",
        "index": "9",
        "is_ignore": "false",
        "is_row_identifier": "false",
        "is_target": "false",
        "name": "N.",
        "number_of_missing_values": "0"
      },
      {
        "data_type": "numeric",
        "index": "10",
        "is_ignore": "false",
        "is_row_identifier": "false",
        "is_target": "false",
        "name": "nAB",
        "number_of_missing_values": "0"
      },
      {
        "data_type": "numeric",
        "index": "11",
        "is_ignore": "false",
        "is_row_identifier": "false",
        "is_target": "false",
        "name": "nAT",
        "number_of_missing_values": "0"
      },
      {
        "data_type": "numeric",
        "index": "12",
        "is_ignore": "false",
        "is_row_identifier": "false",
        "is_target": "false",
        "name": "nB",
        "number_of_missing_values": "0"
      },
      {
        "data_type": "numeric",
        "index": "13",
        "is_ignore": "false",
        "is_row_identifier": "false",
        "is_target": "false",
        "name": "nBM",
        "number_of_missing_values": "0"
      },
      {
        "data_type": "numeric",
        "index": "14",
        "is_ignore": "false",
        "is_row_identifier": "false",
        "is_target": "false",
        "name": "nBO",
        "number_of_missing_values": "0"
      },
      {
        "data_type": "numeric",
        "index": "15",
        "is_ignore": "false",
        "is_row_identifier": "false",
        "is_target": "false",
        "name": "nBR",
        "number_of_missing_values": "0"
      },
      {
        "data_type": "numeric",
        "index": "16",
        "is_ignore": "false",
        "is_row_identifier": "false",
        "is_target": "false",
        "name": "nBT",
        "number_of_missing_values": "0"
      },
      {
        "data_type": "numeric",
        "index": "17",
        "is_ignore": "false",
        "is_row_identifier": "false",
        "is_target": "false",
        "name": "nC",
        "number_of_missing_values": "0"
      },
      {
        "data_type": "numeric",
        "index": "18",
        "is_ignore": "false",
        "is_row_identifier": "false",
        "is_target": "false",
        "name": "nCL",
        "number_of_missing_values": "0"
      },
      {
        "data_type": "numeric",
        "index": "19",
        "is_ignore": "false",
        "is_row_identifier": "false",
        "is_target": "false",
        "name": "nCsp",
        "number_of_missing_values": "0"
      },
      {
        "data_type": "numeric",
        "index": "20",
        "is_ignore": "false",
        "is_row_identifier": "false",
        "is_target": "false",
        "name": "nCsp2",
        "number_of_missing_values": "0"
      },
      {
        "data_type": "numeric",
        "index": "21",
        "is_ignore": "false",
        "is_row_identifier": "false",
        "is_target": "false",
        "name": "nCsp3",
        "number_of_missing_values": "0"
      },
      {
        "data_type": "numeric",
        "index": "22",
        "is_ignore": "false",
        "is_row_identifier": "false",
        "is_target": "false",
        "name": "nDB",
        "number_of_missing_values": "0"
      },
      {
        "data_type": "numeric",
        "index": "23",
        "is_ignore": "false",
        "is_row_identifier": "false",
        "is_target": "false",
        "name": "nF",
        "number_of_missing_values": "0"
      },
      {
        "data_type": "numeric",
        "index": "24",
        "is_ignore": "false",
        "is_row_identifier": "false",
        "is_target": "false",
        "name": "nH",
        "number_of_missing_values": "0"
      },
      {
        "data_type": "numeric",
        "index": "25",
        "is_ignore": "false",
        "is_row_identifier": "false",
        "is_target": "false",
        "name": "nHet",
        "number_of_missing_values": "0"
      },
      {
        "data_type": "numeric",
        "index": "26",
        "is_ignore": "false",
        "is_row_identifier": "false",
        "is_target": "false",
        "name": "nHM",
        "number_of_missing_values": "0"
      },
      {
        "data_type": "numeric",
        "index": "27",
        "is_ignore": "false",
        "is_row_identifier": "false",
        "is_target": "false",
        "name": "nI",
        "number_of_missing_values": "0"
      },
      {
        "data_type": "numeric",
        "index": "28",
        "is_ignore": "false",
        "is_row_identifier": "false",
        "is_target": "false",
        "name": "nN",
        "number_of_missing_values": "0"
      },
      {
        "data_type": "numeric",
        "index": "29",
        "is_ignore": "false",
        "is_row_identifier": "false",
        "is_target": "false",
        "name": "nO",
        "number_of_missing_values": "0"
      },
      {
        "data_type": "numeric",
        "index": "30",
        "is_ignore": "false",
        "is_row_identifier": "false",
        "is_target": "false",
        "name": "nP",
        "number_of_missing_values": "0"
      },
      {
        "data_type": "numeric",
        "index": "31",
        "is_ignore": "false",
        "is_row_identifier": "false",
        "is_target": "false",
        "name": "nS",
        "number_of_missing_values": "0"
      },
      {
        "data_type": "numeric",
        "index": "32",
        "is_ignore": "false",
        "is_row_identifier": "false",
        "is_target": "false",
        "name": "nSK",
        "number_of_missing_values": "0"
      },
      {
        "data_type": "numeric",
        "index": "33",
        "is_ignore": "false",
        "is_row_identifier": "false",
        "is_target": "false",
        "name": "nTB",
        "number_of_missing_values": "0"
      },
      {
        "data_type": "numeric",
        "index": "34",
        "is_ignore": "false",
        "is_row_identifier": "false",
        "is_target": "false",
        "name": "nX",
        "number_of_missing_values": "0"
      },
      {
        "data_type": "numeric",
        "index": "35",
        "is_ignore": "false",
        "is_row_identifier": "false",
        "is_target": "false",
        "name": "O.",
        "number_of_missing_values": "0"
      },
      {
        "data_type": "numeric",
        "index": "36",
        "is_ignore": "false",
        "is_row_identifier": "false",
        "is_target": "false",
        "name": "RBF",
        "number_of_missing_values": "0"
      },
      {
        "data_type": "numeric",
        "index": "37",
        "is_ignore": "false",
        "is_row_identifier": "false",
        "is_target": "false",
        "name": "RBN",
        "number_of_missing_values": "0"
      },
      {
        "data_type": "numeric",
        "index": "38",
        "is_ignore": "false",
        "is_row_identifier": "false",
        "is_target": "false",
        "name": "SCBO",
        "number_of_missing_values": "0"
      },
      {
        "data_type": "numeric",
        "index": "39",
        "is_ignore": "false",
        "is_row_identifier": "false",
        "is_target": "false",
        "name": "Se",
        "number_of_missing_values": "0"
      },
      {
        "data_type": "numeric",
        "index": "40",
        "is_ignore": "false",
        "is_row_identifier": "false",
        "is_target": "false",
        "name": "Si",
        "number_of_missing_values": "0"
      },
      {
        "data_type": "numeric",
        "index": "41",
        "is_ignore": "false",
        "is_row_identifier": "false",
        "is_target": "false",
        "name": "Sp",
        "number_of_missing_values": "0"
      },
      {
        "data_type": "numeric",
        "index": "42",
        "is_ignore": "false",
        "is_row_identifier": "false",
        "is_target": "false",
        "name": "Sv",
        "number_of_missing_values": "0"
      },
      {
        "data_type": "numeric",
        "index": "43",
        "is_ignore": "false",
        "is_row_identifier": "false",
        "is_target": "false",
        "name": "X.",
        "number_of_missing_values": "0"
      },
      {
        "data_type": "numeric",
        "index": "44",
        "is_ignore": "false",
        "is_row_identifier": "false",
        "is_target": "true",
        "name": "pXC50",
        "number_of_missing_values": "0"
      }
    ]
  }
}