"molecule_id","FCFP4_1024b299","FCFP4_1024b334","FCFP4_1024b371","FCFP4_1024b937","FCFP4_1024b324","FCFP4_1024b241","FCFP4_1024b187","FCFP4_1024b1020","FCFP4_1024b1003","FCFP4_1024b395","FCFP4_1024b37","FCFP4_1024b61","FCFP4_1024b722","FCFP4_1024b229","FCFP4_1024b644","FCFP4_1024b10","FCFP4_1024b4","FCFP4_1024b181","FCFP4_1024b557","FCFP4_1024b540","FCFP4_1024b902","FCFP4_1024b985","FCFP4_1024b346","FCFP4_1024b614","FCFP4_1024b208","FCFP4_1024b240","FCFP4_1024b444","FCFP4_1024b942","FCFP4_1024b152","FCFP4_1024b280","FCFP4_1024b983","FCFP4_1024b312","FCFP4_1024b955","FCFP4_1024b227","FCFP4_1024b861","FCFP4_1024b297","FCFP4_1024b326","FCFP4_1024b256","FCFP4_1024b859","FCFP4_1024b6","FCFP4_1024b870","FCFP4_1024b918","FCFP4_1024b697","FCFP4_1024b661","FCFP4_1024b603","FCFP4_1024b172","FCFP4_1024b801","FCFP4_1024b72","FCFP4_1024b899","FCFP4_1024b177","FCFP4_1024b720","pXC50"
{11 1,15 1,16 1,17 1,20 1,23 1,25 1,27 1,28 1,29 1,34 1,35 1,36 1,37 1,38 1,39 1,40 1,41 1,43 1,44 1,45 1,52 6.29}
{0 CHEMBL100879,1 1,2 1,3 1,4 1,5 1,6 1,7 1,8 1,9 1,10 1,11 1,15 1,16 1,18 1,19 1,20 1,22 1,24 1,28 1,30 1,38 1,49 1,50 1,52 9.699}
{0 CHEMBL101361,1 1,2 1,3 1,4 1,5 1,6 1,7 1,8 1,9 1,10 1,11 1,15 1,16 1,18 1,19 1,20 1,22 1,24 1,28 1,30 1,38 1,49 1,50 1,52 9.046}
{0 CHEMBL101411,1 1,2 1,3 1,4 1,5 1,6 1,7 1,8 1,9 1,10 1,11 1,12 1,15 1,16 1,18 1,19 1,20 1,21 1,22 1,24 1,28 1,30 1,38 1,49 1,50 1,52 8}
{0 CHEMBL101596,1 1,2 1,3 1,4 1,5 1,6 1,7 1,8 1,9 1,10 1,11 1,12 1,13 1,14 1,15 1,16 1,18 1,20 1,22 1,24 1,26 1,28 1,30 1,38 1,49 1,52 9.699}
{0 CHEMBL1019,17 1,52 5}
{0 CHEMBL1022,17 1,52 5.959}
{0 CHEMBL10316,17 1,22 1,25 1,29 1,39 1,42 1,45 1,49 1,51 1,52 7.75}
{0 CHEMBL10332,17 1,22 1,25 1,28 1,29 1,39 1,42 1,45 1,49 1,51 1,52 8}
{0 CHEMBL10347,8 1,11 1,15 1,16 1,17 1,28 1,31 1,52 9}
{0 CHEMBL106525,11 1,15 1,16 1,17 1,28 1,31 1,52 7.553}
{0 CHEMBL1079079,4 1,16 1,17 1,28 1,43 1,52 5}
{0 CHEMBL1082723,17 1,29 1,31 1,45 1,52 5}
{0 CHEMBL1085510,1 1,2 1,3 1,4 1,5 1,6 1,7 1,8 1,9 1,10 1,11 1,12 1,15 1,16 1,19 1,21 1,28 1,38 1,50 1,52 8.347}
{0 CHEMBL1098724,7 1,10 1,17 1,24 1,39 1,52 8.398}
{0 CHEMBL1108,10 1,11 1,15 1,16 1,17 1,19 1,25 1,26 1,38 1,50 1,52 5.754}
{0 CHEMBL1113,17 1,39 1,45 1,51 1,52 5.498}
{0 CHEMBL114166,11 1,15 1,16 1,19 1,20 1,22 1,24 1,52 7.194}
{0 CHEMBL1189234,15 1,16 1,17 1,18 1,52 6.166}
{0 CHEMBL1200633,5 1,17 1,19 1,20 1,28 1,43 1,52 5.407}
{0 CHEMBL1201203,15 1,16 1,27 1,52 6.403}
{0 CHEMBL1204386,10 1,17 1,25 1,29 1,39 1,42 1,45 1,51 1,52 5.37}
{0 CHEMBL12089,28 1,30 1,31 1,49 1,52 5.547}
{0 CHEMBL12131,16 1,17 1,49 1,52 5.149}
{0 CHEMBL1221,52 5.307}
{0 CHEMBL1221512,8 1,17 1,29 1,39 1,45 1,52 5.504}
{0 CHEMBL122404,8 1,11 1,15 1,16 1,20 1,28 1,31 1,52 7.553}
{0 CHEMBL1224527,9 1,15 1,17 1,36 1,39 1,45 1,52 5.959}
{0 CHEMBL122671,11 1,15 1,16 1,17 1,23 1,27 1,35 1,37 1,38 1,39 1,40 1,41 1,43 1,44 1,45 1,52 6.783}
{0 CHEMBL123102,11 1,15 1,16 1,17 1,23 1,27 1,28 1,35 1,37 1,38 1,39 1,40 1,41 1,43 1,44 1,45 1,52 6.252}
{0 CHEMBL123138,11 1,15 1,16 1,31 1,52 7.553}
{0 CHEMBL123325,8 1,11 1,15 1,16 1,20 1,28 1,31 1,52 8.301}
{0 CHEMBL123349,11 1,15 1,16 1,52 7.699}
{0 CHEMBL123448,11 1,15 1,16 1,31 1,52 7.456}
{0 CHEMBL123769,11 1,15 1,16 1,23 1,27 1,28 1,35 1,37 1,38 1,40 1,41 1,43 1,44 1,52 5.77}
{0 CHEMBL125294,11 1,15 1,16 1,17 1,23 1,27 1,35 1,37 1,38 1,39 1,40 1,41 1,43 1,44 1,45 1,52 6.491}
{0 CHEMBL1255582,52 7.86}
{0 CHEMBL1255616,52 8.83}
{0 CHEMBL1255617,52 8.62}
{0 CHEMBL1255723,52 9.77}
{0 CHEMBL1255724,52 9.36}
{0 CHEMBL1255770,52 8.932}
{0 CHEMBL1255771,52 8.55}
{0 CHEMBL1255837,8 1,11 1,15 1,16 1,17 1,29 1,31 1,45 1,52 8.482}
{0 CHEMBL1256378,52 9.53}
{0 CHEMBL1256414,52 9.75}
{0 CHEMBL1256502,28 1,52 7.18}
{0 CHEMBL1256503,28 1,52 8.475}
{0 CHEMBL1256565,35 1,52 7.99}
{0 CHEMBL1256566,52 8.81}
{0 CHEMBL1256608,52 7.05}
{0 CHEMBL1256609,52 9.27}
{0 CHEMBL1256610,52 8.9}
{0 CHEMBL1258223,11 1,15 1,16 1,17 1,22 1,38 1,52 6.255}
{0 CHEMBL1258452,8 1,11 1,15 1,16 1,17 1,28 1,30 1,38 1,52 6.005}
{0 CHEMBL1258671,8 1,11 1,15 1,16 1,17 1,22 1,38 1,52 6.227}
{0 CHEMBL1262,7 1,8 1,9 1,10 1,52 5.38}
{0 CHEMBL1276139,17 1,19 1,24 1,25 1,29 1,34 1,39 1,42 1,45 1,51 1,52 6.74}
{0 CHEMBL1276140,17 1,19 1,24 1,25 1,29 1,34 1,39 1,42 1,45 1,51 1,52 7.375}
{0 CHEMBL1276218,17 1,24 1,25 1,29 1,34 1,39 1,42 1,45 1,51 1,52 7.25}
{0 CHEMBL1276219,17 1,24 1,25 1,29 1,34 1,39 1,42 1,45 1,51 1,52 6.9}
{0 CHEMBL1276220,17 1,24 1,25 1,29 1,34 1,39 1,42 1,45 1,51 1,52 7.325}
{0 CHEMBL1276247,17 1,25 1,29 1,34 1,39 1,42 1,45 1,51 1,52 6.5}
{0 CHEMBL1276248,17 1,25 1,29 1,34 1,39 1,42 1,45 1,51 1,52 6.9}
{0 CHEMBL1278084,7 1,17 1,25 1,29 1,34 1,39 1,42 1,45 1,51 1,52 7.55}
{0 CHEMBL1278085,7 1,17 1,25 1,29 1,34 1,39 1,42 1,45 1,51 1,52 5.6}
{0 CHEMBL128168,17 1,25 1,29 1,34 1,39 1,42 1,45 1,51 1,52 6.7}
{0 CHEMBL1289,22 1,26 1,52 5.393}
{0 CHEMBL1306,11 1,15 1,16 1,22 1,52 6.379}
{0 CHEMBL130884,17 1,25 1,29 1,39 1,42 1,45 1,51 1,52 6.15}
{0 CHEMBL1323615,8 1,17 1,28 1,52 5.24}
{0 CHEMBL133455,17 1,22 1,24 1,31 1,52 4.854}
{0 CHEMBL133868,17 1,22 1,24 1,31 1,52 4.523}
{0 CHEMBL134,17 1,39 1,42 1,45 1,51 1,52 7.255}
{0 CHEMBL1381098,28 1,31 1,52 4.263}
{0 CHEMBL13852,17 1,22 1,24 1,25 1,29 1,39 1,42 1,45 1,51 1,52 6.33}
{0 CHEMBL13856,11 1,15 1,16 1,17 1,28 1,38 1,49 1,52 7.086}
{0 CHEMBL1385840,8 1,10 1,11 1,15 1,16 1,17 1,19 1,29 1,31 1,45 1,52 7.77}
{0 CHEMBL140872,10 1,11 1,15 1,16 1,25 1,26 1,38 1,52 7.097}
{0 CHEMBL14208,17 1,25 1,29 1,34 1,39 1,42 1,45 1,49 1,51 1,52 6.4}
{0 CHEMBL1437,17 1,39 1,52 6.1}
{0 CHEMBL14638,10 1,22 1,25 1,52 7.2}
{0 CHEMBL147077,7 1,11 1,15 1,16 1,17 1,20 1,25 1,28 1,29 1,34 1,36 1,37 1,38 1,39 1,40 1,41 1,44 1,45 1,52 5.649}
{0 CHEMBL1479,12 1,17 1,20 1,26 1,43 1,52 4.624}
{0 CHEMBL1491,17 1,20 1,28 1,35 1,39 1,52 5.745}
{0 CHEMBL150161,10 1,11 1,15 1,16 1,17 1,25 1,26 1,38 1,52 7.405}
{0 CHEMBL15245,8 1,11 1,15 1,16 1,17 1,28 1,31 1,52 8.463}
{0 CHEMBL155866,17 1,25 1,29 1,34 1,39 1,42 1,45 1,51 1,52 6.6}
{0 CHEMBL156336,17 1,24 1,25 1,29 1,34 1,39 1,42 1,45 1,51 1,52 6.54}
{0 CHEMBL157138,10 1,11 1,15 1,16 1,17 1,19 1,31 1,45 1,52 8.366}
{0 CHEMBL157206,17 1,19 1,25 1,29 1,34 1,39 1,42 1,45 1,51 1,52 6.89}
{0 CHEMBL157955,17 1,25 1,29 1,34 1,39 1,42 1,45 1,51 1,52 6.56}
{0 CHEMBL162058,11 1,15 1,16 1,19 1,20 1,28 1,31 1,32 1,33 1,46 1,47 1,52 7.24}
{0 CHEMBL162147,11 1,15 1,16 1,19 1,20 1,28 1,31 1,32 1,33 1,46 1,47 1,52 8.44}
{0 CHEMBL162232,11 1,15 1,16 1,19 1,20 1,28 1,31 1,32 1,33 1,47 1,52 9.07}
{0 CHEMBL162370,11 1,15 1,16 1,19 1,20 1,28 1,31 1,32 1,33 1,46 1,47 1,52 8.889}
{0 CHEMBL162436,11 1,15 1,16 1,19 1,20 1,28 1,31 1,32 1,33 1,46 1,47 1,52 8.57}
{0 CHEMBL162490,11 1,15 1,16 1,19 1,20 1,28 1,31 1,32 1,33 1,46 1,47 1,52 9.15}
{0 CHEMBL162501,11 1,15 1,16 1,19 1,20 1,28 1,31 1,32 1,33 1,46 1,47 1,52 8.77}
{0 CHEMBL1626,11 1,15 1,16 1,52 7.438}
{0 CHEMBL162682,11 1,15 1,16 1,19 1,20 1,26 1,28 1,31 1,32 1,33 1,46 1,47 1,52 9.21}
{0 CHEMBL1627,11 1,15 1,16 1,17 1,23 1,27 1,29 1,38 1,43 1,45 1,52 8.62}
{0 CHEMBL1628227,11 1,15 1,16 1,19 1,24 1,38 1,52 5.988}
{0 CHEMBL162826,11 1,15 1,16 1,19 1,20 1,28 1,31 1,32 1,33 1,46 1,47 1,52 8.79}
{0 CHEMBL1630578,11 1,15 1,16 1,19 1,20 1,38 1,52 5.521}
{0 CHEMBL163190,11 1,15 1,16 1,19 1,20 1,28 1,31 1,32 1,33 1,47 1,52 8.971}
{0 CHEMBL1632158,11 1,15 1,16 1,17 1,28 1,31 1,38 1,39 1,45 1,52 5}
{0 CHEMBL1632174,11 1,15 1,16 1,17 1,28 1,31 1,38 1,39 1,45 1,52 5}
{0 CHEMBL163247,11 1,15 1,16 1,19 1,20 1,26 1,28 1,31 1,32 1,33 1,46 1,47 1,52 8.87}
{0 CHEMBL1643902,11 1,15 1,16 1,52 5.684}
{0 CHEMBL164612,11 1,15 1,16 1,19 1,20 1,28 1,31 1,32 1,33 1,46 1,47 1,52 8.65}
{0 CHEMBL165181,11 1,15 1,16 1,19 1,20 1,28 1,31 1,32 1,33 1,46 1,47 1,52 7.85}
{0 CHEMBL165350,11 1,15 1,16 1,19 1,20 1,26 1,28 1,31 1,32 1,33 1,46 1,47 1,52 9.16}
{0 CHEMBL165677,11 1,15 1,16 1,19 1,20 1,31 1,32 1,33 1,46 1,47 1,52 7.56}
{0 CHEMBL165776,11 1,15 1,16 1,19 1,20 1,28 1,31 1,32 1,33 1,46 1,52 8.18}
{0 CHEMBL165796,11 1,15 1,16 1,19 1,20 1,28 1,31 1,32 1,33 1,46 1,47 1,52 8.921}
{0 CHEMBL1672288,4 1,16 1,29 1,52 5}
{0 CHEMBL1689423,11 1,15 1,16 1,17 1,28 1,31 1,52 7.959}
{0 CHEMBL17157,11 1,15 1,16 1,17 1,38 1,47 1,52 5.426}
{0 CHEMBL1729,6 1,7 1,8 1,11 1,15 1,16 1,17 1,22 1,24 1,28 1,38 1,45 1,52 6.528}
{0 CHEMBL1732,8 1,11 1,15 1,16 1,17 1,29 1,31 1,45 1,52 8.411}
{0 CHEMBL175853,1 1,2 1,3 1,4 1,5 1,6 1,7 1,8 1,9 1,10 1,11 1,12 1,13 1,14 1,15 1,16 1,18 1,20 1,21 1,22 1,24 1,26 1,28 1,38 1,52 9.699}
{0 CHEMBL175911,1 1,2 1,3 1,4 1,5 1,6 1,7 1,8 1,9 1,10 1,11 1,12 1,13 1,14 1,15 1,16 1,18 1,20 1,21 1,22 1,24 1,26 1,38 1,52 9.523}
{0 CHEMBL176002,1 1,2 1,3 1,4 1,5 1,6 1,7 1,8 1,9 1,10 1,11 1,12 1,13 1,14 1,15 1,16 1,18 1,20 1,21 1,22 1,24 1,26 1,28 1,38 1,52 9.699}
{0 CHEMBL176116,1 1,2 1,3 1,4 1,5 1,6 1,7 1,8 1,9 1,10 1,11 1,12 1,13 1,14 1,15 1,16 1,18 1,20 1,21 1,22 1,24 1,26 1,38 1,52 9.699}
{0 CHEMBL176261,1 1,2 1,3 1,4 1,5 1,6 1,7 1,8 1,9 1,10 1,11 1,12 1,13 1,14 1,15 1,16 1,18 1,20 1,21 1,22 1,24 1,26 1,38 1,52 10}
{0 CHEMBL178588,1 1,2 1,3 1,4 1,5 1,6 1,7 1,8 1,9 1,10 1,11 1,12 1,13 1,14 1,15 1,16 1,18 1,20 1,21 1,22 1,24 1,26 1,38 1,52 8.796}
{0 CHEMBL17860,10 1,17 1,25 1,29 1,34 1,39 1,42 1,45 1,51 1,52 7.16}
{0 CHEMBL179237,1 1,2 1,3 1,4 1,5 1,6 1,7 1,8 1,9 1,10 1,11 1,12 1,13 1,14 1,15 1,16 1,18 1,20 1,21 1,22 1,24 1,26 1,35 1,38 1,52 9.699}
{0 CHEMBL179648,4 1,6 1,11 1,15 1,16 1,24 1,38 1,52 7.692}
{0 CHEMBL180322,1 1,2 1,3 1,4 1,5 1,6 1,7 1,8 1,9 1,10 1,11 1,12 1,13 1,14 1,15 1,16 1,18 1,19 1,20 1,21 1,22 1,24 1,26 1,38 1,52 9.301}
{0 CHEMBL180470,1 1,2 1,3 1,4 1,5 1,6 1,7 1,8 1,9 1,10 1,11 1,12 1,13 1,14 1,15 1,16 1,20 1,21 1,22 1,24 1,26 1,38 1,52 10}
{0 CHEMBL180561,11 1,15 1,16 1,17 1,20 1,23 1,25 1,27 1,29 1,34 1,35 1,36 1,37 1,38 1,39 1,40 1,41 1,43 1,44 1,45 1,52 6.489}
{0 CHEMBL18329,8 1,11 1,15 1,16 1,17 1,29 1,31 1,45 1,52 7.42}
{0 CHEMBL1909065,17 1,24 1,28 1,52 5.793}
{0 CHEMBL1909072,11 1,15 1,16 1,17 1,29 1,38 1,52 7.347}
{0 CHEMBL191703,11 1,15 1,16 1,19 1,20 1,52 7.978}
{0 CHEMBL19215,8 1,11 1,15 1,16 1,17 1,24 1,31 1,39 1,45 1,52 6.724}
{0 CHEMBL19236,17 1,28 1,39 1,42 1,45 1,51 1,52 5.699}
{0 CHEMBL193435,6 1,11 1,15 1,16 1,52 6.13}
{0 CHEMBL193458,8 1,11 1,15 1,16 1,17 1,25 1,28 1,29 1,31 1,39 1,45 1,52 8.284}
{0 CHEMBL193639,6 1,11 1,15 1,16 1,52 7.183}
{0 CHEMBL1940418,11 1,15 1,16 1,38 1,39 1,52 6.511}
{0 CHEMBL1940419,11 1,15 1,16 1,22 1,38 1,52 7.346}
{0 CHEMBL1940420,11 1,15 1,16 1,22 1,38 1,52 6.711}
{0 CHEMBL194659,6 1,11 1,15 1,16 1,52 6.699}
{0 CHEMBL194849,7 1,17 1,39 1,42 1,45 1,51 1,52 7.893}
{0 CHEMBL195437,7 1,39 1,52 4.847}
{0 CHEMBL1956191,17 1,25 1,29 1,34 1,39 1,42 1,45 1,51 1,52 6.545}
{0 CHEMBL1956192,17 1,25 1,29 1,34 1,39 1,42 1,45 1,51 1,52 6.55}
{0 CHEMBL1956193,17 1,24 1,25 1,29 1,34 1,39 1,42 1,45 1,51 1,52 6.055}
{0 CHEMBL1956194,17 1,24 1,25 1,29 1,34 1,39 1,42 1,45 1,51 1,52 6.58}
{0 CHEMBL1956195,17 1,24 1,25 1,29 1,34 1,39 1,42 1,45 1,51 1,52 6.56}
{0 CHEMBL1956196,17 1,22 1,25 1,29 1,34 1,39 1,42 1,45 1,49 1,51 1,52 5}
{0 CHEMBL1956197,17 1,25 1,29 1,34 1,39 1,42 1,45 1,49 1,51 1,52 6.17}
{0 CHEMBL1956198,17 1,25 1,29 1,34 1,39 1,42 1,45 1,49 1,51 1,52 6.2}
{0 CHEMBL1956199,17 1,25 1,28 1,29 1,34 1,39 1,42 1,45 1,49 1,51 1,52 5.01}
{0 CHEMBL1956200,17 1,24 1,25 1,29 1,34 1,39 1,42 1,45 1,48 1,51 1,52 5.42}
{0 CHEMBL1956201,17 1,24 1,25 1,29 1,34 1,39 1,42 1,45 1,51 1,52 5.06}
{0 CHEMBL1956202,5 1,10 1,17 1,24 1,25 1,29 1,34 1,39 1,42 1,45 1,51 1,52 5.13}
{0 CHEMBL1956203,17 1,25 1,29 1,34 1,39 1,42 1,45 1,51 1,52 6.2}
{0 CHEMBL1956899,17 1,25 1,26 1,29 1,39 1,42 1,45 1,51 1,52 5}
{0 CHEMBL1956900,17 1,25 1,26 1,29 1,39 1,42 1,45 1,51 1,52 5}
{0 CHEMBL1956901,17 1,25 1,26 1,29 1,39 1,42 1,45 1,51 1,52 5}
{0 CHEMBL1956902,17 1,25 1,26 1,29 1,39 1,42 1,45 1,51 1,52 5}
{0 CHEMBL1956903,17 1,25 1,26 1,29 1,39 1,42 1,45 1,51 1,52 5}
{0 CHEMBL1956904,17 1,25 1,26 1,29 1,39 1,42 1,45 1,51 1,52 5}
{0 CHEMBL1956905,17 1,25 1,26 1,29 1,39 1,42 1,45 1,51 1,52 5.065}
{0 CHEMBL1956906,17 1,25 1,26 1,29 1,39 1,42 1,45 1,51 1,52 5.105}
{0 CHEMBL195706,6 1,11 1,15 1,16 1,52 6.66}
{0 CHEMBL195925,8 1,11 1,15 1,16 1,17 1,25 1,28 1,29 1,31 1,39 1,45 1,52 8.523}
{0 CHEMBL196064,8 1,11 1,15 1,16 1,17 1,25 1,28 1,29 1,31 1,39 1,45 1,52 8.553}
{0 CHEMBL196344,8 1,11 1,15 1,16 1,17 1,25 1,28 1,29 1,31 1,39 1,45 1,52 7.495}
{0 CHEMBL196400,8 1,11 1,15 1,16 1,17 1,28 1,31 1,52 9.056}
{0 CHEMBL196451,8 1,11 1,15 1,16 1,17 1,25 1,27 1,28 1,29 1,31 1,39 1,45 1,52 9.187}
{0 CHEMBL198949,6 1,11 1,12 1,15 1,16 1,17 1,19 1,29 1,49 1,52 6}
{0 CHEMBL199824,9 1,11 1,15 1,16 1,28 1,31 1,38 1,52 7.625}
{0 CHEMBL2,8 1,17 1,28 1,31 1,49 1,52 7.264}
{0 CHEMBL2030626,11 1,15 1,16 1,52 5.37}
{0 CHEMBL2030634,8 1,11 1,15 1,16 1,38 1,52 6.064}
{0 CHEMBL2031737,11 1,15 1,16 1,31 1,37 1,40 1,41 1,44 1,52 5}
{0 CHEMBL2032049,7 1,8 1,11 1,15 1,16 1,31 1,38 1,44 1,52 5.699}
{0 CHEMBL2058631,17 1,45 1,52 5.24}
{0 CHEMBL2058632,17 1,45 1,52 5}
{0 CHEMBL2058633,17 1,22 1,29 1,52 5.3}
{0 CHEMBL2058634,17 1,22 1,29 1,52 5}
{0 CHEMBL2058635,17 1,22 1,29 1,52 5}
{0 CHEMBL2089155,17 1,24 1,25 1,29 1,34 1,39 1,42 1,45 1,51 1,52 6.565}
{0 CHEMBL2089156,17 1,24 1,25 1,29 1,34 1,39 1,42 1,45 1,51 1,52 6.56}
{0 CHEMBL210578,10 1,11 1,15 1,16 1,17 1,25 1,26 1,52 6.845}
{0 CHEMBL2112969,1 1,2 1,3 1,4 1,6 1,7 1,8 1,9 1,10 1,11 1,15 1,16 1,17 1,22 1,28 1,30 1,38 1,39 1,49 1,52 8.796}
{0 CHEMBL2112970,1 1,2 1,3 1,4 1,5 1,6 1,7 1,8 1,9 1,10 1,11 1,12 1,15 1,16 1,19 1,21 1,28 1,38 1,50 1,52 8.347}
{0 CHEMBL2112971,1 1,2 1,3 1,4 1,6 1,7 1,8 1,9 1,10 1,11 1,15 1,16 1,17 1,19 1,28 1,30 1,38 1,39 1,49 1,50 1,52 8.444}
{0 CHEMBL2112972,1 1,2 1,3 1,4 1,6 1,7 1,8 1,9 1,10 1,11 1,12 1,15 1,16 1,19 1,28 1,30 1,31 1,38 1,52 8.201}
{0 CHEMBL2112973,1 1,2 1,3 1,4 1,5 1,6 1,7 1,8 1,9 1,10 1,11 1,12 1,15 1,16 1,17 1,19 1,21 1,38 1,39 1,45 1,50 1,52 8.569}
{0 CHEMBL2112974,1 1,2 1,3 1,4 1,6 1,7 1,8 1,9 1,10 1,11 1,15 1,16 1,17 1,28 1,30 1,38 1,39 1,49 1,52 7.638}
{0 CHEMBL2112975,1 1,2 1,3 1,4 1,5 1,6 1,7 1,8 1,9 1,10 1,11 1,12 1,15 1,16 1,19 1,21 1,35 1,38 1,50 1,52 8.009}
{0 CHEMBL2112976,1 1,2 1,3 1,4 1,6 1,7 1,8 1,9 1,10 1,11 1,15 1,16 1,17 1,28 1,30 1,31 1,38 1,39 1,49 1,52 7.921}
{0 CHEMBL2112977,1 1,2 1,3 1,4 1,5 1,6 1,7 1,8 1,9 1,10 1,11 1,12 1,14 1,15 1,16 1,18 1,20 1,21 1,28 1,30 1,38 1,49 1,52 8.398}
{0 CHEMBL2112978,1 1,2 1,3 1,4 1,5 1,6 1,7 1,8 1,9 1,10 1,11 1,12 1,15 1,16 1,19 1,20 1,21 1,22 1,24 1,38 1,50 1,52 8.77}
{0 CHEMBL2112979,1 1,2 1,3 1,4 1,6 1,7 1,8 1,9 1,10 1,11 1,12 1,15 1,16 1,19 1,21 1,38 1,50 1,52 6.951}
{0 CHEMBL2112980,1 1,2 1,3 1,4 1,6 1,7 1,8 1,9 1,10 1,11 1,15 1,16 1,17 1,28 1,30 1,31 1,38 1,39 1,49 1,52 6}
{0 CHEMBL2112981,1 1,2 1,3 1,4 1,6 1,7 1,8 1,9 1,10 1,11 1,12 1,15 1,16 1,17 1,19 1,21 1,38 1,39 1,50 1,52 7.824}
{0 CHEMBL2112982,1 1,2 1,3 1,4 1,6 1,7 1,8 1,9 1,10 1,11 1,12 1,15 1,16 1,19 1,21 1,28 1,30 1,38 1,50 1,52 8.409}
{0 CHEMBL2112983,1 1,2 1,3 1,4 1,6 1,7 1,8 1,9 1,10 1,11 1,12 1,15 1,16 1,17 1,19 1,21 1,28 1,30 1,38 1,39 1,49 1,50 1,52 8.268}
{0 CHEMBL2112984,1 1,2 1,3 1,4 1,6 1,7 1,8 1,9 1,10 1,11 1,15 1,16 1,17 1,28 1,31 1,38 1,39 1,52 8.018}
{0 CHEMBL2112985,1 1,2 1,3 1,4 1,6 1,7 1,8 1,9 1,10 1,11 1,12 1,13 1,14 1,15 1,16 1,17 1,20 1,21 1,26 1,28 1,30 1,38 1,39 1,49 1,52 10}
{0 CHEMBL21343,10 1,17 1,19 1,31 1,39 1,45 1,52 5}
{0 CHEMBL214661,11 1,15 1,16 1,17 1,31 1,52 7.42}
{0 CHEMBL214996,11 1,15 1,16 1,17 1,28 1,31 1,52 8.12}
{0 CHEMBL216072,11 1,15 1,16 1,17 1,28 1,31 1,52 5.301}
{0 CHEMBL216197,11 1,15 1,16 1,17 1,28 1,31 1,38 1,39 1,52 7.086}
{0 CHEMBL216290,11 1,15 1,16 1,17 1,28 1,31 1,52 7.456}
{0 CHEMBL216399,11 1,15 1,16 1,17 1,28 1,31 1,52 6.161}
{0 CHEMBL216464,11 1,15 1,16 1,17 1,28 1,31 1,52 8.189}
{0 CHEMBL216674,11 1,15 1,16 1,17 1,28 1,31 1,52 7.076}
{0 CHEMBL216727,11 1,15 1,16 1,17 1,31 1,52 7.796}
{0 CHEMBL217177,11 1,15 1,16 1,17 1,28 1,31 1,52 7.658}
{0 CHEMBL217180,11 1,15 1,16 1,17 1,52 5.301}
{0 CHEMBL217202,11 1,15 1,16 1,17 1,28 1,31 1,52 8.061}
{0 CHEMBL217203,11 1,15 1,16 1,17 1,28 1,31 1,52 7.387}
{0 CHEMBL217253,11 1,15 1,16 1,17 1,28 1,31 1,52 8.306}
{0 CHEMBL217254,11 1,15 1,16 1,17 1,28 1,31 1,52 8.072}
{0 CHEMBL217278,11 1,15 1,16 1,17 1,28 1,31 1,52 7.119}
{0 CHEMBL217299,17 1,22 1,24 1,45 1,52 8.699}
{0 CHEMBL21731,17 1,27 1,35 1,39 1,45 1,52 5.517}
{0 CHEMBL217366,11 1,15 1,16 1,17 1,28 1,31 1,38 1,52 7.432}
{0 CHEMBL217452,11 1,15 1,16 1,17 1,31 1,52 7.06}
{0 CHEMBL217542,11 1,15 1,16 1,17 1,28 1,31 1,52 8.054}
{0 CHEMBL217567,11 1,15 1,16 1,17 1,28 1,31 1,52 8.057}
{0 CHEMBL217568,11 1,15 1,16 1,17 1,31 1,52 6.87}
{0 CHEMBL217665,11 1,15 1,16 1,17 1,28 1,31 1,52 5.77}
{0 CHEMBL217768,11 1,15 1,16 1,17 1,39 1,52 6.959}
{0 CHEMBL218457,11 1,15 1,16 1,17 1,28 1,31 1,52 8.334}
{0 CHEMBL218675,11 1,15 1,16 1,17 1,28 1,31 1,52 8.487}
{0 CHEMBL218679,11 1,15 1,16 1,17 1,28 1,31 1,52 8.185}
{0 CHEMBL218730,11 1,15 1,16 1,17 1,31 1,52 6.879}
{0 CHEMBL219916,11 1,15 1,16 1,17 1,38 1,49 1,52 5.995}
{0 CHEMBL2203713,17 1,39 1,45 1,52 4.959}
{0 CHEMBL2205361,11 1,15 1,16 1,28 1,31 1,38 1,52 6.604}
{0 CHEMBL2205362,11 1,15 1,16 1,28 1,31 1,38 1,49 1,52 5.812}
{0 CHEMBL2205811,11 1,15 1,16 1,17 1,18 1,28 1,30 1,52 6.254}
{0 CHEMBL2205812,11 1,15 1,16 1,17 1,18 1,28 1,52 5.769}
{0 CHEMBL2205813,11 1,15 1,16 1,17 1,18 1,28 1,49 1,52 5.362}
{0 CHEMBL2205814,11 1,15 1,16 1,17 1,18 1,28 1,30 1,49 1,52 5.727}
{0 CHEMBL2205816,11 1,15 1,16 1,17 1,18 1,52 5.736}
{0 CHEMBL2205823,15 1,16 1,17 1,18 1,24 1,28 1,52 6.156}
{0 CHEMBL2205824,15 1,16 1,17 1,18 1,28 1,30 1,52 5.864}
{0 CHEMBL2205825,15 1,16 1,17 1,18 1,28 1,52 5.827}
{0 CHEMBL2205827,15 1,16 1,17 1,18 1,28 1,30 1,49 1,52 5.941}
{0 CHEMBL2205829,15 1,16 1,17 1,18 1,30 1,49 1,52 5.749}
{0 CHEMBL2205836,11 1,15 1,16 1,17 1,18 1,24 1,28 1,52 6.273}
{0 CHEMBL221523,17 1,25 1,29 1,34 1,37 1,39 1,40 1,41 1,42 1,44 1,45 1,51 1,52 6.52}
{0 CHEMBL221753,22 1,52 5.708}
{0 CHEMBL221989,17 1,25 1,29 1,34 1,39 1,42 1,45 1,51 1,52 5.9}
{0 CHEMBL222138,17 1,25 1,29 1,34 1,37 1,39 1,40 1,41 1,42 1,44 1,45 1,51 1,52 5.91}
{0 CHEMBL222371,8 1,17 1,25 1,29 1,34 1,39 1,42 1,45 1,51 1,52 6.405}
{0 CHEMBL222591,52 5.23}
{0 CHEMBL222592,52 5}
{0 CHEMBL222593,52 5.23}
{0 CHEMBL222798,7 1,17 1,25 1,29 1,34 1,39 1,42 1,45 1,51 1,52 6.48}
{0 CHEMBL222928,17 1,25 1,29 1,34 1,37 1,39 1,40 1,41 1,42 1,44 1,45 1,51 1,52 6.63}
{0 CHEMBL222933,10 1,17 1,25 1,29 1,39 1,42 1,45 1,51 1,52 5.38}
{0 CHEMBL222973,17 1,25 1,29 1,34 1,39 1,42 1,45 1,51 1,52 5.8}
{0 CHEMBL223829,17 1,25 1,29 1,34 1,39 1,42 1,45 1,51 1,52 7.185}
{0 CHEMBL223830,10 1,17 1,25 1,29 1,34 1,39 1,42 1,45 1,51 1,52 6.535}
{0 CHEMBL223836,17 1,25 1,29 1,34 1,39 1,42 1,45 1,51 1,52 7.495}
{0 CHEMBL226335,7 1,10 1,17 1,24 1,52 8.046}
{0 CHEMBL226636,1 1,2 1,3 1,4 1,5 1,6 1,7 1,8 1,9 1,10 1,11 1,12 1,15 1,16 1,18 1,19 1,20 1,21 1,22 1,24 1,28 1,30 1,38 1,49 1,50 1,52 7.391}
{0 CHEMBL229429,4 1,16 1,52 5}
{0 CHEMBL242265,17 1,25 1,29 1,34 1,39 1,42 1,45 1,51 1,52 6.48}
{0 CHEMBL242693,17 1,25 1,29 1,34 1,37 1,39 1,40 1,41 1,42 1,44 1,45 1,51 1,52 6.59}
{0 CHEMBL246228,8 1,11 1,15 1,16 1,17 1,28 1,30 1,49 1,52 7.721}
{0 CHEMBL246229,11 1,15 1,16 1,28 1,30 1,31 1,49 1,52 8.018}
{0 CHEMBL246639,11 1,15 1,16 1,28 1,30 1,31 1,49 1,52 7.721}
{0 CHEMBL246852,11 1,15 1,16 1,28 1,30 1,31 1,49 1,52 7.745}
{0 CHEMBL247664,11 1,15 1,16 1,17 1,28 1,30 1,31 1,39 1,43 1,45 1,49 1,52 8.377}
{0 CHEMBL247665,11 1,15 1,16 1,28 1,30 1,31 1,49 1,52 8.456}
{0 CHEMBL25467,11 1,12 1,15 1,16 1,31 1,52 7.678}
{0 CHEMBL25554,17 1,22 1,28 1,39 1,45 1,49 1,51 1,52 9.097}
{0 CHEMBL260374,17 1,45 1,52 6.46}
{0 CHEMBL262901,11 1,15 1,16 1,17 1,28 1,31 1,52 7.558}
{0 CHEMBL263424,1 1,2 1,3 1,4 1,5 1,6 1,7 1,8 1,9 1,10 1,11 1,12 1,13 1,14 1,15 1,16 1,18 1,20 1,21 1,22 1,24 1,26 1,28 1,30 1,38 1,49 1,52 9.699}
{0 CHEMBL266613,17 1,24 1,25 1,29 1,34 1,39 1,42 1,45 1,51 1,52 6.37}
{0 CHEMBL267464,11 1,15 1,16 1,17 1,28 1,31 1,52 7.456}
{0 CHEMBL268217,11 1,15 1,16 1,17 1,28 1,31 1,52 7.921}
{0 CHEMBL268258,11 1,15 1,16 1,24 1,28 1,31 1,39 1,52 8.678}
{0 CHEMBL268758,11 1,15 1,16 1,17 1,28 1,38 1,49 1,52 7.127}
{0 CHEMBL269538,28 1,31 1,52 6.092}
{0 CHEMBL273485,17 1,25 1,29 1,34 1,39 1,42 1,45 1,51 1,52 6.85}
{0 CHEMBL276417,11 1,15 1,16 1,17 1,31 1,52 7.367}
{0 CHEMBL279436,11 1,15 1,16 1,17 1,20 1,23 1,25 1,27 1,29 1,34 1,35 1,36 1,37 1,38 1,39 1,40 1,41 1,43 1,44 1,45 1,52 6.52}
{0 CHEMBL279516,11 1,15 1,16 1,17 1,28 1,31 1,38 1,45 1,52 6.322}
{0 CHEMBL27979,11 1,15 1,16 1,22 1,52 5.79}
{0 CHEMBL282575,17 1,30 1,52 4.608}
{0 CHEMBL284103,11 1,15 1,16 1,17 1,20 1,23 1,25 1,27 1,29 1,34 1,35 1,36 1,37 1,38 1,39 1,40 1,41 1,43 1,44 1,45 1,52 6.49}
{0 CHEMBL284213,39 1,52 6.764}
{0 CHEMBL284470,11 1,15 1,16 1,17 1,20 1,23 1,25 1,27 1,28 1,29 1,35 1,36 1,37 1,38 1,39 1,40 1,41 1,43 1,44 1,45 1,52 6.55}
{0 CHEMBL284795,19 1,52 7.585}
{0 CHEMBL288772,4 1,11 1,15 1,16 1,17 1,20 1,25 1,28 1,29 1,36 1,38 1,39 1,45 1,52 5.415}
{0 CHEMBL289480,17 1,45 1,52 6.63}
{0 CHEMBL290106,52 5.357}
{0 CHEMBL290860,11 1,15 1,16 1,20 1,23 1,27 1,28 1,35 1,36 1,37 1,38 1,40 1,41 1,43 1,44 1,52 6.523}
{0 CHEMBL291166,11 1,15 1,16 1,17 1,20 1,25 1,28 1,29 1,36 1,38 1,39 1,45 1,52 5.96}
{0 CHEMBL295001,11 1,15 1,16 1,17 1,20 1,25 1,29 1,34 1,36 1,38 1,39 1,45 1,52 5.7}
{0 CHEMBL295186,17 1,43 1,45 1,52 7.48}
{0 CHEMBL295395,11 1,15 1,16 1,17 1,20 1,25 1,28 1,29 1,36 1,38 1,39 1,45 1,52 5.72}
{0 CHEMBL296419,11 1,15 1,16 1,17 1,28 1,38 1,39 1,52 5.708}
{0 CHEMBL296660,17 1,45 1,52 6.91}
{0 CHEMBL297228,17 1,36 1,45 1,52 7.28}
{0 CHEMBL297752,17 1,45 1,50 1,52 7.61}
{0 CHEMBL297827,12 1,17 1,19 1,21 1,45 1,52 7.07}
{0 CHEMBL298936,17 1,22 1,39 1,42 1,45 1,51 1,52 8.051}
{0 CHEMBL299879,17 1,37 1,39 1,40 1,41 1,44 1,45 1,52 7}
{0 CHEMBL30008,4 1,11 1,12 1,15 1,16 1,19 1,21 1,28 1,38 1,50 1,52 6.654}
{0 CHEMBL302698,17 1,25 1,29 1,39 1,42 1,45 1,48 1,51 1,52 5.15}
{0 CHEMBL305660,10 1,11 1,15 1,16 1,25 1,26 1,38 1,52 6.56}
{0 CHEMBL305928,17 1,45 1,52 7.295}
{0 CHEMBL306377,17 1,39 1,45 1,52 7.34}
{0 CHEMBL306792,17 1,25 1,28 1,29 1,39 1,42 1,45 1,51 1,52 6.66}
{0 CHEMBL30739,39 1,52 6.688}
{0 CHEMBL308570,17 1,22 1,49 1,50 1,52 7.721}
{0 CHEMBL308863,17 1,28 1,49 1,50 1,52 5.824}
{0 CHEMBL310335,17 1,45 1,50 1,52 7.61}
{0 CHEMBL312871,11 1,15 1,16 1,17 1,20 1,23 1,25 1,27 1,29 1,30 1,34 1,35 1,36 1,38 1,39 1,43 1,45 1,49 1,52 6.14}
{0 CHEMBL313160,11 1,15 1,16 1,17 1,20 1,23 1,25 1,27 1,28 1,29 1,30 1,35 1,36 1,37 1,38 1,39 1,40 1,41 1,43 1,44 1,45 1,52 6.4}
{0 CHEMBL313189,8 1,9 1,11 1,15 1,16 1,52 6}
{0 CHEMBL313251,11 1,15 1,16 1,17 1,20 1,23 1,25 1,27 1,29 1,30 1,34 1,35 1,36 1,38 1,39 1,43 1,45 1,49 1,52 6.11}
{0 CHEMBL313631,28 1,52 5}
{0 CHEMBL313953,11 1,15 1,16 1,17 1,20 1,23 1,25 1,27 1,29 1,34 1,35 1,36 1,37 1,38 1,39 1,40 1,41 1,43 1,44 1,45 1,52 6.37}
{0 CHEMBL31410,8 1,11 1,15 1,16 1,17 1,28 1,31 1,52 6.793}
{0 CHEMBL314107,6 1,8 1,9 1,11 1,15 1,16 1,52 6}
{0 CHEMBL314960,11 1,15 1,16 1,17 1,20 1,23 1,25 1,27 1,28 1,29 1,35 1,36 1,38 1,39 1,43 1,45 1,52 6}
{0 CHEMBL315392,11 1,15 1,16 1,17 1,20 1,23 1,25 1,27 1,28 1,29 1,34 1,35 1,36 1,37 1,38 1,39 1,40 1,41 1,43 1,44 1,45 1,52 6.09}
{0 CHEMBL315538,11 1,15 1,16 1,17 1,20 1,23 1,25 1,27 1,28 1,29 1,35 1,36 1,38 1,39 1,43 1,45 1,52 5.94}
{0 CHEMBL315772,6 1,8 1,9 1,11 1,15 1,16 1,52 6.06}
{0 CHEMBL315914,11 1,15 1,16 1,17 1,20 1,23 1,25 1,27 1,28 1,29 1,35 1,36 1,38 1,39 1,43 1,45 1,52 6.38}
{0 CHEMBL316495,11 1,15 1,16 1,17 1,20 1,23 1,25 1,27 1,29 1,34 1,35 1,36 1,37 1,38 1,39 1,40 1,41 1,43 1,44 1,45 1,52 6.355}
{0 CHEMBL318235,1 1,2 1,3 1,4 1,5 1,6 1,7 1,8 1,9 1,10 1,11 1,12 1,13 1,14 1,15 1,16 1,18 1,20 1,21 1,22 1,24 1,26 1,28 1,30 1,38 1,49 1,52 9.155}
{0 CHEMBL319119,1 1,2 1,3 1,4 1,5 1,6 1,7 1,8 1,9 1,10 1,11 1,12 1,13 1,14 1,15 1,16 1,18 1,20 1,22 1,24 1,26 1,28 1,30 1,38 1,49 1,52 9.699}
{0 CHEMBL319530,1 1,2 1,3 1,4 1,5 1,6 1,7 1,8 1,9 1,10 1,11 1,15 1,16 1,18 1,19 1,20 1,22 1,24 1,28 1,30 1,38 1,49 1,50 1,52 9.398}
{0 CHEMBL319573,1 1,2 1,3 1,4 1,5 1,6 1,7 1,8 1,9 1,10 1,11 1,12 1,15 1,16 1,18 1,19 1,20 1,22 1,24 1,28 1,30 1,38 1,49 1,50 1,52 8.553}
{0 CHEMBL320736,11 1,15 1,16 1,17 1,20 1,23 1,25 1,27 1,29 1,34 1,35 1,36 1,37 1,38 1,39 1,40 1,41 1,43 1,44 1,45 1,52 6.054}
{0 CHEMBL323579,11 1,15 1,16 1,17 1,20 1,23 1,25 1,27 1,29 1,34 1,35 1,36 1,37 1,38 1,39 1,40 1,41 1,43 1,44 1,45 1,52 6.69}
{0 CHEMBL327712,11 1,15 1,16 1,17 1,20 1,23 1,25 1,27 1,28 1,29 1,35 1,36 1,38 1,39 1,43 1,45 1,52 6.8}
{0 CHEMBL327775,11 1,15 1,16 1,17 1,20 1,23 1,25 1,27 1,29 1,34 1,35 1,36 1,37 1,38 1,39 1,40 1,41 1,43 1,44 1,45 1,52 6.32}
{0 CHEMBL327875,1 1,2 1,3 1,4 1,5 1,6 1,7 1,8 1,9 1,10 1,11 1,15 1,16 1,18 1,19 1,20 1,22 1,24 1,28 1,30 1,38 1,49 1,50 1,52 9.222}
{0 CHEMBL327931,11 1,15 1,16 1,17 1,20 1,25 1,28 1,29 1,36 1,38 1,39 1,40 1,41 1,44 1,45 1,52 7.32}
{0 CHEMBL328114,1 1,2 1,3 1,4 1,5 1,6 1,7 1,8 1,9 1,10 1,11 1,12 1,15 1,16 1,18 1,19 1,20 1,21 1,22 1,24 1,28 1,30 1,38 1,49 1,50 1,52 8.208}
{0 CHEMBL328195,1 1,2 1,3 1,4 1,5 1,6 1,7 1,8 1,9 1,10 1,11 1,15 1,16 1,18 1,19 1,20 1,22 1,24 1,28 1,30 1,38 1,49 1,50 1,52 9.523}
{0 CHEMBL328377,1 1,2 1,3 1,4 1,5 1,6 1,7 1,8 1,9 1,10 1,11 1,12 1,13 1,14 1,15 1,16 1,18 1,20 1,22 1,24 1,28 1,30 1,38 1,49 1,50 1,52 8.328}
{0 CHEMBL328631,1 1,2 1,3 1,4 1,5 1,6 1,7 1,8 1,9 1,10 1,11 1,15 1,16 1,18 1,19 1,20 1,22 1,24 1,28 1,30 1,38 1,49 1,50 1,52 9.097}
{0 CHEMBL328735,1 1,2 1,3 1,4 1,5 1,6 1,7 1,8 1,9 1,10 1,11 1,15 1,16 1,18 1,20 1,22 1,24 1,25 1,26 1,28 1,30 1,38 1,49 1,52 8.276}
{0 CHEMBL329065,1 1,2 1,3 1,4 1,5 1,6 1,7 1,8 1,9 1,10 1,11 1,15 1,16 1,18 1,19 1,20 1,22 1,24 1,28 1,30 1,38 1,49 1,50 1,52 9.222}
{0 CHEMBL334255,52 5.825}
{0 CHEMBL351200,11 1,15 1,16 1,19 1,20 1,28 1,31 1,32 1,33 1,46 1,47 1,52 8.879}
{0 CHEMBL351483,11 1,15 1,16 1,19 1,20 1,26 1,28 1,31 1,32 1,33 1,46 1,47 1,52 9.14}
{0 CHEMBL353972,52 8.38}
{0 CHEMBL362051,11 1,15 1,16 1,20 1,28 1,38 1,49 1,52 8}
{0 CHEMBL362699,4 1,8 1,11 1,15 1,16 1,20 1,22 1,24 1,38 1,52 6.301}
{0 CHEMBL362954,17 1,18 1,28 1,39 1,42 1,45 1,51 1,52 8.42}
{0 CHEMBL363581,6 1,11 1,15 1,16 1,52 7.108}
{0 CHEMBL364270,6 1,11 1,15 1,16 1,52 6.169}
{0 CHEMBL366164,6 1,11 1,15 1,16 1,52 7.032}
{0 CHEMBL369378,1 1,2 1,3 1,4 1,5 1,6 1,7 1,8 1,9 1,10 1,11 1,12 1,13 1,14 1,15 1,16 1,18 1,20 1,21 1,22 1,24 1,26 1,38 1,52 9.301}
{0 CHEMBL369938,8 1,11 1,15 1,16 1,17 1,25 1,28 1,29 1,31 1,39 1,45 1,52 8.959}
{0 CHEMBL370005,8 1,11 1,15 1,16 1,17 1,25 1,28 1,29 1,31 1,39 1,45 1,52 8.097}
{0 CHEMBL371300,7 1,17 1,28 1,31 1,52 5.164}
{0 CHEMBL371352,6 1,9 1,11 1,15 1,16 1,52 7.161}
{0 CHEMBL371516,8 1,11 1,15 1,16 1,17 1,25 1,28 1,29 1,31 1,39 1,45 1,52 8.071}
{0 CHEMBL373535,17 1,25 1,29 1,34 1,39 1,42 1,45 1,51 1,52 7.3}
{0 CHEMBL373830,17 1,25 1,29 1,34 1,39 1,42 1,45 1,51 1,52 5.79}
{0 CHEMBL374584,7 1,17 1,25 1,29 1,34 1,39 1,42 1,45 1,51 1,52 7.54}
{0 CHEMBL374954,17 1,25 1,29 1,34 1,39 1,42 1,45 1,51 1,52 6.15}
{0 CHEMBL382310,8 1,11 1,15 1,16 1,17 1,28 1,31 1,52 7.721}
{0 CHEMBL383978,11 1,15 1,16 1,17 1,28 1,31 1,52 7.959}
{0 CHEMBL384318,11 1,15 1,16 1,17 1,31 1,52 6.409}
{0 CHEMBL384925,11 1,15 1,16 1,17 1,28 1,31 1,52 7.456}
{0 CHEMBL385310,17 1,25 1,29 1,34 1,39 1,42 1,45 1,51 1,52 6.88}
{0 CHEMBL385722,17 1,28 1,31 1,39 1,45 1,51 1,52 6.688}
{0 CHEMBL386169,11 1,15 1,16 1,17 1,28 1,31 1,52 8.047}
{0 CHEMBL390718,1 1,2 1,3 1,4 1,6 1,7 1,8 1,9 1,10 1,11 1,12 1,13 1,14 1,15 1,16 1,17 1,20 1,21 1,26 1,28 1,30 1,38 1,39 1,49 1,52 8.081}
{0 CHEMBL392771,11 1,15 1,16 1,17 1,19 1,28 1,30 1,31 1,39 1,45 1,49 1,52 8.027}
{0 CHEMBL392991,11 1,15 1,16 1,28 1,30 1,31 1,49 1,52 8.097}
{0 CHEMBL392992,11 1,15 1,16 1,28 1,30 1,31 1,49 1,52 7.699}
{0 CHEMBL393597,11 1,15 1,16 1,28 1,30 1,31 1,49 1,52 7.959}
{0 CHEMBL394218,11 1,15 1,16 1,17 1,28 1,30 1,31 1,38 1,45 1,49 1,52 9.097}
{0 CHEMBL396013,17 1,25 1,29 1,34 1,39 1,42 1,45 1,51 1,52 6.52}
{0 CHEMBL397753,17 1,25 1,29 1,34 1,37 1,39 1,40 1,41 1,42 1,44 1,45 1,51 1,52 6.2}
{0 CHEMBL402143,11 1,15 1,16 1,17 1,20 1,22 1,28 1,38 1,49 1,52 6.83}
{0 CHEMBL405355,11 1,15 1,16 1,20 1,23 1,27 1,28 1,35 1,36 1,37 1,38 1,40 1,41 1,43 1,44 1,52 6.432}
{0 CHEMBL40650,8 1,11 1,15 1,16 1,17 1,24 1,28 1,38 1,52 7.78}
{0 CHEMBL407734,10 1,17 1,25 1,52 5}
{0 CHEMBL411,7 1,52 4.82}
{0 CHEMBL415,11 1,15 1,16 1,52 5.85}
{0 CHEMBL41929,11 1,15 1,16 1,20 1,23 1,27 1,28 1,35 1,36 1,37 1,38 1,40 1,41 1,43 1,44 1,52 6.481}
{0 CHEMBL419316,1 1,2 1,3 1,4 1,5 1,6 1,7 1,8 1,9 1,10 1,11 1,15 1,16 1,18 1,19 1,20 1,22 1,24 1,28 1,30 1,38 1,49 1,50 1,52 9.461}
{0 CHEMBL419336,1 1,2 1,3 1,4 1,5 1,6 1,7 1,8 1,9 1,10 1,11 1,12 1,13 1,14 1,15 1,16 1,18 1,20 1,22 1,24 1,26 1,28 1,30 1,38 1,49 1,52 9.155}
{0 CHEMBL419448,17 1,25 1,29 1,39 1,42 1,45 1,48 1,51 1,52 6.445}
{0 CHEMBL419894,1 1,2 1,3 1,4 1,5 1,6 1,7 1,8 1,9 1,10 1,11 1,12 1,15 1,16 1,18 1,19 1,20 1,21 1,22 1,24 1,28 1,30 1,38 1,49 1,50 1,52 7.638}
{0 CHEMBL42,11 1,12 1,15 1,16 1,17 1,50 1,52 8.538}
{0 CHEMBL420,17 1,52 5.956}
{0 CHEMBL420060,11 1,15 1,16 1,17 1,20 1,28 1,38 1,39 1,45 1,49 1,52 6.883}
{0 CHEMBL420830,1 1,2 1,3 1,4 1,5 1,6 1,7 1,8 1,9 1,10 1,11 1,12 1,15 1,16 1,18 1,19 1,20 1,21 1,22 1,24 1,28 1,30 1,38 1,49 1,50 1,52 8.022}
{0 CHEMBL422597,1 1,2 1,3 1,4 1,5 1,6 1,7 1,8 1,9 1,10 1,11 1,12 1,15 1,16 1,19 1,20 1,21 1,22 1,24 1,28 1,30 1,38 1,50 1,52 8.638}
{0 CHEMBL42335,4 1,11 1,15 1,16 1,17 1,20 1,25 1,29 1,34 1,36 1,38 1,39 1,45 1,52 5.33}
{0 CHEMBL424917,11 1,15 1,16 1,17 1,31 1,52 6.914}
{0 CHEMBL425324,1 1,2 1,3 1,4 1,5 1,6 1,7 1,8 1,9 1,10 1,11 1,12 1,13 1,14 1,15 1,16 1,18 1,20 1,21 1,22 1,24 1,26 1,38 1,52 9.301}
{0 CHEMBL425622,11 1,15 1,16 1,17 1,28 1,31 1,52 7.172}
{0 CHEMBL425803,11 1,15 1,16 1,17 1,28 1,31 1,52 7.63}
{0 CHEMBL425983,11 1,15 1,16 1,17 1,28 1,31 1,52 8.638}
{0 CHEMBL426317,9 1,11 1,15 1,16 1,18 1,28 1,38 1,52 6.963}
{0 CHEMBL426900,17 1,25 1,29 1,34 1,39 1,42 1,45 1,51 1,52 6.34}
{0 CHEMBL426959,1 1,2 1,3 1,4 1,5 1,6 1,7 1,8 1,9 1,10 1,11 1,12 1,15 1,16 1,19 1,21 1,38 1,52 7.959}
{0 CHEMBL428407,11 1,15 1,16 1,17 1,19 1,28 1,30 1,31 1,39 1,45 1,49 1,52 8.027}
{0 CHEMBL430112,17 1,52 4.699}
{0 CHEMBL43064,4 1,11 1,12 1,15 1,16 1,19 1,21 1,28 1,38 1,50 1,52 6.186}
{0 CHEMBL432155,17 1,22 1,39 1,50 1,52 6.799}
{0 CHEMBL43491,4 1,11 1,15 1,16 1,17 1,20 1,25 1,29 1,34 1,36 1,38 1,39 1,45 1,52 5.83}
{0 CHEMBL435301,6 1,11 1,15 1,16 1,52 7.585}
{0 CHEMBL435352,1 1,2 1,3 1,4 1,5 1,6 1,7 1,8 1,9 1,10 1,11 1,12 1,13 1,14 1,15 1,16 1,18 1,20 1,21 1,22 1,24 1,26 1,28 1,38 1,52 10.523}
{0 CHEMBL43594,4 1,11 1,15 1,16 1,17 1,20 1,25 1,28 1,29 1,36 1,38 1,39 1,45 1,52 5.185}
{0 CHEMBL436150,11 1,15 1,16 1,20 1,23 1,27 1,28 1,35 1,36 1,37 1,38 1,40 1,41 1,43 1,44 1,52 6.347}
{0 CHEMBL437314,7 1,17 1,28 1,31 1,52 5.247}
{0 CHEMBL43860,11 1,15 1,16 1,17 1,20 1,25 1,29 1,34 1,36 1,38 1,39 1,45 1,52 6.504}
{0 CHEMBL440594,11 1,15 1,16 1,17 1,28 1,31 1,38 1,39 1,52 7.026}
{0 CHEMBL442,8 1,10 1,11 1,15 1,16 1,17 1,19 1,29 1,31 1,45 1,52 7.921}
{0 CHEMBL442045,17 1,25 1,29 1,34 1,39 1,42 1,45 1,51 1,52 5.84}
{0 CHEMBL442815,8 1,9 1,17 1,24 1,25 1,28 1,29 1,34 1,39 1,42 1,45 1,51 1,52 5.51}
{0 CHEMBL445,17 1,19 1,39 1,45 1,52 6.693}
{0 CHEMBL448620,11 1,15 1,16 1,17 1,20 1,23 1,25 1,27 1,28 1,29 1,35 1,36 1,37 1,38 1,39 1,40 1,41 1,43 1,44 1,45 1,52 6.337}
{0 CHEMBL451229,17 1,24 1,25 1,29 1,34 1,39 1,42 1,45 1,51 1,52 7.395}
{0 CHEMBL451821,11 1,15 1,16 1,17 1,19 1,20 1,28 1,45 1,52 7.11}
{0 CHEMBL467094,10 1,11 1,15 1,16 1,28 1,30 1,49 1,52 6.742}
{0 CHEMBL470432,11 1,15 1,16 1,20 1,38 1,52 6.13}
{0 CHEMBL47313,17 1,45 1,50 1,52 7.97}
{0 CHEMBL475306,10 1,28 1,30 1,52 6}
{0 CHEMBL476569,4 1,6 1,11 1,15 1,16 1,17 1,19 1,22 1,38 1,39 1,45 1,49 1,52 8.42}
{0 CHEMBL476774,4 1,6 1,11 1,15 1,16 1,17 1,19 1,22 1,38 1,39 1,45 1,49 1,52 7.804}
{0 CHEMBL476839,11 1,15 1,16 1,17 1,20 1,22 1,28 1,38 1,49 1,52 6.845}
{0 CHEMBL477608,4 1,6 1,11 1,15 1,16 1,17 1,19 1,22 1,38 1,39 1,43 1,45 1,49 1,52 7.516}
{0 CHEMBL477816,4 1,6 1,11 1,15 1,16 1,17 1,19 1,22 1,38 1,39 1,45 1,49 1,52 7.602}
{0 CHEMBL478026,4 1,6 1,11 1,15 1,16 1,17 1,19 1,22 1,38 1,39 1,45 1,49 1,52 8.523}
{0 CHEMBL479,11 1,15 1,16 1,18 1,28 1,52 6.767}
{0 CHEMBL481,11 1,15 1,16 1,17 1,19 1,20 1,31 1,43 1,52 5.499}
{0 CHEMBL48341,17 1,39 1,45 1,52 6.91}
{0 CHEMBL483993,10 1,24 1,28 1,30 1,52 6}
{0 CHEMBL484158,17 1,28 1,52 6}
{0 CHEMBL488974,4 1,6 1,11 1,15 1,16 1,17 1,19 1,22 1,38 1,39 1,45 1,49 1,52 8.036}
{0 CHEMBL490632,5 1,10 1,11 1,15 1,16 1,22 1,28 1,38 1,49 1,52 6.812}
{0 CHEMBL49137,17 1,39 1,42 1,45 1,51 1,52 7.569}
{0 CHEMBL491419,4 1,6 1,11 1,15 1,16 1,22 1,38 1,49 1,52 8.385}
{0 CHEMBL491420,4 1,6 1,11 1,15 1,16 1,22 1,38 1,49 1,52 8.746}
{0 CHEMBL492444,17 1,22 1,25 1,29 1,39 1,42 1,45 1,49 1,51 1,52 5.8}
{0 CHEMBL492445,17 1,22 1,25 1,29 1,39 1,42 1,45 1,49 1,51 1,52 5.9}
{0 CHEMBL492639,8 1,9 1,17 1,21 1,24 1,25 1,29 1,34 1,39 1,42 1,45 1,51 1,52 6.235}
{0 CHEMBL492648,17 1,22 1,25 1,28 1,29 1,39 1,42 1,45 1,49 1,51 1,52 6.61}
{0 CHEMBL49284,17 1,39 1,42 1,45 1,51 1,52 6.921}
{0 CHEMBL493,8 1,10 1,11 1,15 1,16 1,17 1,19 1,29 1,31 1,45 1,52 6.284}
{0 CHEMBL493272,17 1,22 1,25 1,29 1,39 1,42 1,45 1,49 1,51 1,52 6.09}
{0 CHEMBL493675,17 1,24 1,25 1,29 1,34 1,39 1,42 1,45 1,51 1,52 6.47}
{0 CHEMBL49395,17 1,36 1,39 1,42 1,45 1,51 1,52 5.85}
{0 CHEMBL494678,4 1,8 1,11 1,15 1,16 1,17 1,52 6.538}
{0 CHEMBL494885,17 1,25 1,29 1,39 1,42 1,45 1,51 1,52 6.9}
{0 CHEMBL495095,17 1,19 1,24 1,25 1,29 1,34 1,39 1,42 1,45 1,51 1,52 7.185}
{0 CHEMBL495096,17 1,24 1,25 1,29 1,34 1,39 1,42 1,45 1,51 1,52 7.57}
{0 CHEMBL495097,8 1,9 1,17 1,24 1,25 1,29 1,34 1,39 1,42 1,45 1,51 1,52 5.45}
{0 CHEMBL496,52 5.575}
{0 CHEMBL50588,8 1,11 1,15 1,16 1,17 1,28 1,30 1,39 1,45 1,49 1,52 6.74}
{0 CHEMBL506214,17 1,18 1,28 1,30 1,52 6}
{0 CHEMBL50719,17 1,45 1,50 1,52 7.18}
{0 CHEMBL50720,17 1,39 1,45 1,50 1,52 7.53}
{0 CHEMBL508112,52 5.78}
{0 CHEMBL514837,4 1,6 1,11 1,15 1,16 1,17 1,19 1,22 1,38 1,39 1,45 1,49 1,52 8.319}
{0 CHEMBL515170,17 1,19 1,29 1,52 4.983}
{0 CHEMBL515331,4 1,6 1,11 1,15 1,16 1,17 1,19 1,22 1,30 1,38 1,39 1,45 1,49 1,52 8.721}
{0 CHEMBL516,11 1,12 1,15 1,16 1,20 1,47 1,52 5.894}
{0 CHEMBL516088,5 1,10 1,11 1,15 1,16 1,22 1,28 1,38 1,49 1,52 6.478}
{0 CHEMBL518592,6 1,11 1,15 1,16 1,22 1,28 1,38 1,49 1,52 7.56}
{0 CHEMBL522151,17 1,22 1,25 1,29 1,39 1,42 1,45 1,49 1,51 1,52 5.5}
{0 CHEMBL523048,17 1,25 1,29 1,39 1,42 1,45 1,51 1,52 6.4}
{0 CHEMBL524153,4 1,6 1,11 1,15 1,16 1,17 1,19 1,22 1,38 1,39 1,45 1,49 1,52 8.721}
{0 CHEMBL531,8 1,11 1,15 1,16 1,28 1,31 1,52 5.851}
{0 CHEMBL537669,8 1,11 1,15 1,16 1,17 1,28 1,31 1,52 7.567}
{0 CHEMBL54,10 1,11 1,15 1,16 1,17 1,25 1,26 1,38 1,52 5.734}
{0 CHEMBL540035,17 1,22 1,25 1,29 1,39 1,42 1,45 1,51 1,52 6.57}
{0 CHEMBL540542,17 1,25 1,28 1,29 1,39 1,42 1,45 1,51 1,52 6.84}
{0 CHEMBL542402,10 1,17 1,25 1,29 1,39 1,42 1,45 1,51 1,52 5.15}
{0 CHEMBL544290,17 1,25 1,29 1,39 1,42 1,45 1,48 1,51 1,52 5.4}
{0 CHEMBL553276,17 1,25 1,29 1,39 1,42 1,45 1,51 1,52 6.78}
{0 CHEMBL554416,17 1,25 1,29 1,39 1,42 1,45 1,48 1,51 1,52 5.58}
{0 CHEMBL555146,11 1,15 1,16 1,31 1,52 5}
{0 CHEMBL564,11 1,15 1,16 1,52 6.597}
{0 CHEMBL569933,17 1,39 1,42 1,45 1,51 1,52 6.56}
{0 CHEMBL570863,17 1,39 1,42 1,45 1,51 1,52 6.57}
{0 CHEMBL570973,17 1,19 1,39 1,42 1,45 1,51 1,52 7.185}
{0 CHEMBL571314,17 1,39 1,42 1,45 1,51 1,52 6.715}
{0 CHEMBL576078,17 1,39 1,42 1,45 1,51 1,52 6.83}
{0 CHEMBL576623,17 1,39 1,42 1,45 1,51 1,52 7.25}
{0 CHEMBL576819,17 1,39 1,42 1,45 1,51 1,52 5.54}
{0 CHEMBL584554,8 1,9 1,10 1,12 1,17 1,19 1,31 1,52 6.668}
{0 CHEMBL588119,17 1,39 1,45 1,52 5.463}
{0 CHEMBL590615,17 1,39 1,45 1,52 7.699}
{0 CHEMBL595449,7 1,15 1,16 1,52 5}
{0 CHEMBL597,7 1,17 1,25 1,29 1,38 1,39 1,42 1,45 1,51 1,52 7.446}
{0 CHEMBL602850,11 1,15 1,16 1,17 1,18 1,52 5}
{0 CHEMBL608560,15 1,16 1,17 1,18 1,52 5}
{0 CHEMBL611,8 1,17 1,28 1,31 1,49 1,52 6.661}
{0 CHEMBL61861,11 1,15 1,16 1,52 5}
{0 CHEMBL621,9 1,11 1,15 1,16 1,19 1,38 1,52 5.712}
{0 CHEMBL629,11 1,15 1,16 1,19 1,38 1,52 7.229}
{0 CHEMBL6310,17 1,28 1,31 1,39 1,45 1,52 5.759}
{0 CHEMBL643,15 1,16 1,52 5.614}
{0 CHEMBL6437,9 1,11 1,15 1,16 1,52 7.478}
{0 CHEMBL647,8 1,17 1,39 1,42 1,45 1,49 1,51 1,52 7.523}
{0 CHEMBL64894,5 1,11 1,19 1,20 1,28 1,42 1,52 5.725}
{0 CHEMBL654,9 1,11 1,15 1,16 1,52 6.7}
{0 CHEMBL679,17 1,39 1,45 1,52 5.611}
{0 CHEMBL70326,17 1,25 1,29 1,39 1,42 1,45 1,48 1,51 1,52 5.15}
{0 CHEMBL70563,17 1,25 1,29 1,39 1,42 1,45 1,48 1,51 1,52 5.2}
{0 CHEMBL70634,17 1,25 1,29 1,39 1,42 1,45 1,48 1,49 1,51 1,52 5.32}
{0 CHEMBL70676,17 1,22 1,39 1,42 1,45 1,51 1,52 6.39}
{0 CHEMBL70691,17 1,25 1,28 1,29 1,39 1,42 1,45 1,51 1,52 6.22}
{0 CHEMBL70692,17 1,25 1,28 1,29 1,39 1,42 1,45 1,51 1,52 6.66}
{0 CHEMBL707,8 1,17 1,22 1,28 1,31 1,49 1,52 6.553}
{0 CHEMBL70740,17 1,25 1,29 1,39 1,42 1,45 1,48 1,51 1,52 5.385}
{0 CHEMBL70751,17 1,25 1,28 1,29 1,39 1,42 1,45 1,49 1,51 1,52 6.77}
{0 CHEMBL70973,17 1,25 1,29 1,39 1,42 1,45 1,48 1,51 1,52 5.45}
{0 CHEMBL71,11 1,15 1,16 1,52 6.427}
{0 CHEMBL71001,17 1,25 1,28 1,29 1,39 1,42 1,45 1,48 1,51 1,52 5.3}
{0 CHEMBL71479,17 1,25 1,29 1,39 1,42 1,45 1,48 1,51 1,52 5.625}
{0 CHEMBL715,11 1,15 1,16 1,17 1,52 7.1}
{0 CHEMBL716,11 1,15 1,16 1,17 1,38 1,39 1,52 6.376}
{0 CHEMBL72147,17 1,22 1,39 1,42 1,45 1,51 1,52 6.135}
{0 CHEMBL723,17 1,22 1,28 1,31 1,39 1,45 1,49 1,51 1,52 7.466}
{0 CHEMBL72441,17 1,25 1,28 1,29 1,39 1,42 1,45 1,51 1,52 6.7}
{0 CHEMBL726,4 1,11 1,15 1,16 1,17 1,30 1,38 1,39 1,52 6.812}
{0 CHEMBL72724,17 1,25 1,28 1,29 1,39 1,42 1,45 1,51 1,52 6.22}
{0 CHEMBL72753,17 1,22 1,39 1,42 1,45 1,51 1,52 6.71}
{0 CHEMBL72768,17 1,25 1,28 1,29 1,39 1,42 1,45 1,49 1,51 1,52 6.94}
{0 CHEMBL728,4 1,11 1,15 1,16 1,38 1,52 7.504}
{0 CHEMBL72958,17 1,24 1,39 1,52 5.7}
{0 CHEMBL72995,17 1,22 1,45 1,52 6.135}
{0 CHEMBL73164,17 1,22 1,52 4.31}
{0 CHEMBL73392,17 1,22 1,52 4.55}
{0 CHEMBL74071,17 1,25 1,29 1,39 1,42 1,45 1,48 1,51 1,52 5.15}
{0 CHEMBL74114,17 1,25 1,29 1,39 1,42 1,45 1,48 1,51 1,52 6.255}
{0 CHEMBL74283,17 1,22 1,39 1,42 1,45 1,51 1,52 6.825}
{0 CHEMBL74342,17 1,22 1,45 1,52 4.94}
{0 CHEMBL74449,17 1,36 1,52 5.056}
{0 CHEMBL74467,17 1,25 1,29 1,39 1,42 1,45 1,48 1,49 1,51 1,52 5.5}
{0 CHEMBL74544,17 1,36 1,52 6.398}
{0 CHEMBL75030,17 1,39 1,45 1,52 7.92}
{0 CHEMBL75201,52 4.78}
{0 CHEMBL75257,17 1,28 1,52 5.301}
{0 CHEMBL75491,17 1,50 1,52 6.469}
{0 CHEMBL7568,11 1,15 1,16 1,17 1,28 1,31 1,38 1,52 5.414}
{0 CHEMBL762,6 1,17 1,25 1,29 1,39 1,42 1,45 1,51 1,52 5.58}
{0 CHEMBL76457,17 1,52 5.62}
{0 CHEMBL778,52 7.51}
{0 CHEMBL77913,17 1,28 1,30 1,50 1,52 6.291}
{0 CHEMBL78190,17 1,24 1,28 1,30 1,50 1,52 6.538}
{0 CHEMBL787,12 1,17 1,21 1,28 1,31 1,52 5.277}
{0 CHEMBL809,17 1,45 1,52 5.349}
{0 CHEMBL81,7 1,11 1,15 1,16 1,22 1,28 1,31 1,38 1,52 6.552}
{0 CHEMBL81485,8 1,9 1,17 1,39 1,45 1,52 6}
{0 CHEMBL833,11 1,15 1,16 1,52 5.93}
{0 CHEMBL836,17 1,22 1,24 1,28 1,39 1,45 1,49 1,51 1,52 8.102}
{0 CHEMBL83658,6 1,8 1,9 1,11 1,15 1,16 1,52 5.73}
{0 CHEMBL844,17 1,22 1,39 1,42 1,45 1,51 1,52 7.219}
{0 CHEMBL84931,6 1,8 1,9 1,11 1,15 1,16 1,52 5.93}
{0 CHEMBL85,11 1,15 1,16 1,20 1,28 1,31 1,32 1,33 1,38 1,47 1,52 8.495}
{0 CHEMBL85735,6 1,8 1,9 1,11 1,15 1,16 1,30 1,52 6}
{0 CHEMBL862,17 1,29 1,45 1,52 5.191}
{0 CHEMBL88388,11 1,15 1,16 1,17 1,20 1,23 1,25 1,27 1,29 1,30 1,34 1,35 1,36 1,38 1,39 1,43 1,45 1,49 1,52 6.39}
{0 CHEMBL88448,11 1,15 1,16 1,20 1,23 1,27 1,28 1,35 1,36 1,37 1,38 1,40 1,41 1,43 1,44 1,52 6.61}
{0 CHEMBL88628,11 1,15 1,16 1,17 1,20 1,23 1,25 1,27 1,29 1,30 1,34 1,35 1,36 1,38 1,39 1,43 1,45 1,49 1,52 5.99}
{0 CHEMBL89243,4 1,11 1,15 1,16 1,17 1,20 1,23 1,25 1,27 1,28 1,29 1,35 1,36 1,38 1,39 1,43 1,45 1,52 6.06}
{0 CHEMBL89685,11 1,15 1,16 1,17 1,20 1,23 1,25 1,27 1,29 1,34 1,35 1,36 1,37 1,38 1,39 1,40 1,41 1,43 1,44 1,45 1,52 6.43}
{0 CHEMBL90247,1 1,2 1,3 1,4 1,5 1,6 1,7 1,8 1,9 1,10 1,11 1,12 1,15 1,16 1,18 1,19 1,20 1,21 1,22 1,24 1,28 1,38 1,50 1,52 8.721}
{0 CHEMBL90419,1 1,2 1,3 1,4 1,5 1,6 1,7 1,8 1,9 1,10 1,11 1,15 1,16 1,18 1,20 1,22 1,24 1,28 1,30 1,38 1,49 1,52 8.721}
{0 CHEMBL90843,1 1,2 1,3 1,4 1,5 1,6 1,7 1,8 1,9 1,10 1,11 1,15 1,16 1,18 1,20 1,22 1,24 1,28 1,30 1,38 1,49 1,52 7.051}
{0 CHEMBL90943,1 1,2 1,3 1,4 1,5 1,6 1,7 1,8 1,9 1,10 1,11 1,12 1,15 1,16 1,19 1,20 1,21 1,22 1,24 1,38 1,50 1,52 8.77}
{0 CHEMBL90966,1 1,2 1,3 1,4 1,5 1,6 1,7 1,8 1,9 1,10 1,11 1,15 1,16 1,18 1,20 1,22 1,24 1,28 1,30 1,31 1,38 1,49 1,52 7.444}
{0 CHEMBL90997,17 1,45 1,52 7.721}
{0 CHEMBL91022,11 1,15 1,16 1,17 1,20 1,25 1,28 1,29 1,36 1,37 1,38 1,39 1,40 1,41 1,44 1,45 1,52 7.09}
{0 CHEMBL91157,1 1,2 1,3 1,4 1,5 1,6 1,7 1,8 1,9 1,10 1,11 1,12 1,13 1,14 1,15 1,16 1,18 1,20 1,21 1,22 1,24 1,26 1,28 1,30 1,38 1,49 1,52 8.854}
{0 CHEMBL91297,1 1,2 1,3 1,4 1,5 1,6 1,7 1,8 1,9 1,10 1,11 1,15 1,16 1,18 1,20 1,22 1,24 1,28 1,30 1,31 1,38 1,49 1,52 7.051}
{0 CHEMBL91415,11 1,15 1,16 1,17 1,20 1,23 1,25 1,27 1,28 1,29 1,30 1,35 1,36 1,38 1,39 1,43 1,45 1,49 1,52 6.24}
{0 CHEMBL91550,11 1,15 1,16 1,17 1,20 1,23 1,25 1,27 1,29 1,34 1,35 1,36 1,37 1,38 1,39 1,40 1,41 1,43 1,44 1,45 1,52 6.72}
{0 CHEMBL91824,1 1,2 1,3 1,4 1,5 1,6 1,7 1,8 1,9 1,10 1,11 1,15 1,16 1,18 1,20 1,22 1,24 1,28 1,30 1,31 1,38 1,49 1,52 7.523}
{0 CHEMBL91956,11 1,15 1,16 1,17 1,19 1,20 1,23 1,25 1,27 1,28 1,29 1,35 1,36 1,37 1,38 1,39 1,40 1,41 1,43 1,44 1,45 1,52 6.61}
{0 CHEMBL92322,11 1,15 1,16 1,17 1,20 1,23 1,25 1,27 1,28 1,29 1,31 1,35 1,36 1,38 1,39 1,43 1,45 1,52 6.2}
{0 CHEMBL92496,1 1,2 1,3 1,4 1,5 1,6 1,7 1,8 1,9 1,10 1,11 1,15 1,16 1,18 1,20 1,22 1,24 1,28 1,30 1,38 1,49 1,52 7.051}
{0 CHEMBL92860,1 1,2 1,3 1,4 1,5 1,6 1,7 1,8 1,9 1,10 1,11 1,15 1,16 1,18 1,20 1,22 1,24 1,28 1,30 1,31 1,38 1,49 1,52 8.266}
{0 CHEMBL93171,1 1,2 1,3 1,4 1,5 1,6 1,7 1,8 1,9 1,10 1,11 1,12 1,13 1,14 1,15 1,16 1,18 1,20 1,21 1,22 1,24 1,26 1,28 1,30 1,38 1,49 1,52 9.699}
{0 CHEMBL93489,1 1,2 1,3 1,4 1,5 1,6 1,7 1,8 1,9 1,10 1,11 1,12 1,15 1,16 1,18 1,19 1,20 1,21 1,22 1,24 1,28 1,30 1,38 1,49 1,50 1,52 8.208}
{0 CHEMBL93801,1 1,2 1,3 1,4 1,5 1,6 1,7 1,8 1,9 1,10 1,11 1,15 1,16 1,18 1,20 1,22 1,24 1,28 1,30 1,31 1,38 1,49 1,52 7.886}
{0 CHEMBL94129,1 1,2 1,3 1,4 1,5 1,6 1,7 1,8 1,9 1,10 1,11 1,15 1,16 1,18 1,20 1,22 1,24 1,28 1,30 1,31 1,38 1,49 1,52 8.509}
{0 CHEMBL94190,1 1,2 1,3 1,4 1,5 1,6 1,7 1,8 1,9 1,10 1,11 1,12 1,15 1,16 1,18 1,19 1,20 1,21 1,22 1,24 1,28 1,30 1,38 1,49 1,50 1,52 8.022}
{0 CHEMBL94435,1 1,2 1,3 1,4 1,5 1,6 1,7 1,8 1,9 1,10 1,11 1,15 1,16 1,18 1,20 1,22 1,24 1,28 1,30 1,31 1,38 1,49 1,52 7.051}
{0 CHEMBL95218,1 1,2 1,3 1,4 1,5 1,6 1,7 1,8 1,9 1,10 1,11 1,12 1,15 1,16 1,18 1,19 1,20 1,21 1,22 1,24 1,28 1,30 1,38 1,49 1,50 1,52 9.155}
{0 CHEMBL95290,11 1,15 1,16 1,17 1,20 1,23 1,25 1,27 1,29 1,34 1,35 1,36 1,37 1,38 1,39 1,40 1,41 1,43 1,44 1,45 1,52 6.325}
{0 CHEMBL954,11 1,15 1,16 1,22 1,38 1,52 5.829}
{0 CHEMBL95578,11 1,15 1,16 1,17 1,20 1,23 1,25 1,27 1,29 1,34 1,35 1,36 1,37 1,38 1,39 1,40 1,41 1,43 1,44 1,45 1,52 6.544}
{0 CHEMBL96467,11 1,15 1,16 1,17 1,36 1,38 1,39 1,45 1,52 7.347}
{0 CHEMBL98063,11 1,15 1,16 1,17 1,20 1,23 1,25 1,27 1,29 1,34 1,35 1,36 1,37 1,38 1,39 1,40 1,41 1,43 1,44 1,45 1,52 6.65}
{0 CHEMBL98541,1 1,2 1,3 1,4 1,5 1,6 1,7 1,8 1,9 1,10 1,11 1,15 1,16 1,18 1,19 1,20 1,22 1,24 1,28 1,30 1,38 1,49 1,50 1,52 9.523}
{0 CHEMBL98646,1 1,2 1,3 1,4 1,5 1,6 1,7 1,8 1,9 1,10 1,11 1,12 1,13 1,15 1,16 1,18 1,20 1,22 1,24 1,26 1,28 1,30 1,38 1,49 1,52 9.699}
{0 CHEMBL98889,1 1,2 1,3 1,4 1,5 1,6 1,7 1,8 1,9 1,10 1,11 1,12 1,13 1,14 1,15 1,16 1,18 1,20 1,22 1,24 1,26 1,28 1,30 1,38 1,49 1,52 8.678}
{0 CHEMBL99864,11 1,15 1,16 1,17 1,20 1,23 1,25 1,27 1,28 1,29 1,34 1,35 1,36 1,37 1,38 1,39 1,40 1,41 1,43 1,44 1,45 1,52 6.45}
{0 CHEMBL99868,1 1,2 1,3 1,4 1,5 1,6 1,7 1,8 1,9 1,10 1,11 1,12 1,13 1,14 1,15 1,16 1,18 1,20 1,22 1,24 1,26 1,28 1,30 1,38 1,49 1,52 9.398}
{0 CHEMBL99916,1 1,2 1,3 1,4 1,5 1,6 1,7 1,8 1,9 1,10 1,11 1,12 1,13 1,15 1,16 1,18 1,20 1,22 1,24 1,26 1,28 1,30 1,38 1,49 1,52 9.301}
