{
  "data_features": {
    "feature": [
      {
        "data_type": "nominal",
        "index": "0",
        "is_ignore": "false",
        "is_row_identifier": "true",
        "is_target": "false",
        "name": "molecule_id",
        "nominal_value": [
          "CHEMBL12",
          "CHEMBL130416",
          "CHEMBL13280",
          "CHEMBL145970",
          "CHEMBL146075",
          "CHEMBL146230",
          "CHEMBL146302",
          "CHEMBL146317",
          "CHEMBL147312",
          "CHEMBL147364",
          "CHEMBL147379",
          "CHEMBL147590",
          "CHEMBL1522",
          "CHEMBL174535",
          "CHEMBL19732",
          "CHEMBL20042",
          "CHEMBL204738",
          "CHEMBL286594",
          "CHEMBL296335",
          "CHEMBL343009",
          "CHEMBL343471",
          "CHEMBL344120",
          "CHEMBL35571",
          "CHEMBL356161",
          "CHEMBL356806",
          "CHEMBL358874",
          "CHEMBL363211",
          "CHEMBL373250",
          "CHEMBL394710",
          "CHEMBL443736",
          "CHEMBL449393",
          "CHEMBL45198",
          "CHEMBL453066",
          "CHEMBL453251",
          "CHEMBL453324",
          "CHEMBL45346",
          "CHEMBL454095",
          "CHEMBL454606",
          "CHEMBL454865",
          "CHEMBL454866",
          "CHEMBL458144",
          "CHEMBL458147",
          "CHEMBL458316",
          "CHEMBL458317",
          "CHEMBL458319",
          "CHEMBL458320",
          "CHEMBL458321",
          "CHEMBL459031",
          "CHEMBL461511",
          "CHEMBL461716",
          "CHEMBL461717",
          "CHEMBL461924",
          "CHEMBL461925",
          "CHEMBL471115",
          "CHEMBL471977",
          "CHEMBL471978",
          "CHEMBL498936",
          "CHEMBL499814",
          "CHEMBL499964",
          "CHEMBL505497",
          "CHEMBL505768",
          "CHEMBL509197",
          "CHEMBL510658",
          "CHEMBL510963",
          "CHEMBL511684",
          "CHEMBL511685",
          "CHEMBL518197",
          "CHEMBL52030",
          "CHEMBL522055",
          "CHEMBL58757",
          "CHEMBL646",
          "CHEMBL6597",
          "CHEMBL661",
          "CHEMBL73096",
          "CHEMBL73416",
          "CHEMBL911"
        ],
        "number_of_missing_values": "0"
      },
      {
        "data_type": "numeric",
        "index": "1",
        "is_ignore": "false",
        "is_row_identifier": "false",
        "is_target": "false",
        "name": "AMW",
        "number_of_missing_values": "0"
      },
      {
        "data_type": "numeric",
        "index": "2",
        "is_ignore": "false",
        "is_row_identifier": "false",
        "is_target": "false",
        "name": "C.",
        "number_of_missing_values": "0"
      },
      {
        "data_type": "numeric",
        "index": "3",
        "is_ignore": "false",
        "is_row_identifier": "false",
        "is_target": "false",
        "name": "H.",
        "number_of_missing_values": "0"
      },
      {
        "data_type": "numeric",
        "index": "4",
        "is_ignore": "false",
        "is_row_identifier": "false",
        "is_target": "false",
        "name": "Me",
        "number_of_missing_values": "0"
      },
      {
        "data_type": "numeric",
        "index": "5",
        "is_ignore": "false",
        "is_row_identifier": "false",
        "is_target": "true",
        "name": "pXC50",
        "number_of_missing_values": "0"
      }
    ]
  }
}