{
  "data_set_description": {
    "collection_date": "November 2013",
    "creator": "Dr Jeremy Besnard, Dr Ivan Olier, Dr Noureddin Sadawi, Dr Larisa Soldatova, Dr Crina Grosan, Prof Ross King, Dr Richard Bickerton, Prof Andrew Hopkins and Dr Willem van Hoorn",
    "default_target_attribute": "pXC50",
    "description": "This dataset contains QSAR data (from ChEMBL version 17) showing activity values (unit is pseudo-pCI50) of several compounds on drug target ChEMBL_ID: CHEMBL2536 (TID: 10845), and it has 110 rows and 1221 features (not including molecule IDs and class feature: molecule_id and pXC50). The features represent Molecular Descriptors which were generated from SMILES strings. Missing value imputation was applied to this dataset (By choosing the Median).",
    "description_version": "1",
    "file_id": "3693515",
    "format": "ARFF",
    "id": "40326",
    "licence": "Public",
    "md5_checksum": "a4118d40004f882d677a107da05aedc4",
    "minio_url": "https://data.openml.org/datasets/0004/40326/dataset_40326.pq",
    "name": "QSAR-DATASET-FOR-DRUG-TARGET-CHEMBL2536",
    "original_data_url": "https://www.ebi.ac.uk/chembl/target/inspect/CHEMBL2536",
    "parquet_url": "https://data.openml.org/datasets/0004/40326/dataset_40326.pq",
    "processing_date": "2018-10-04 07:39:48",
    "row_id_attribute": "molecule_id",
    "status": "deactivated",
    "tag": [
      "MetaQSAR",
      "study_13"
    ],
    "upload_date": "2016-07-16T11:04:17",
    "url": "https://api.openml.org/data/v1/download/3693515/QSAR-DATASET-FOR-DRUG-TARGET-CHEMBL2536.arff",
    "version": "12",
    "visibility": "public"
  }
}