{
  "data_set_description": {
    "collection_date": "November 2013",
    "creator": "Dr Jeremy Besnard, Dr Ivan Olier, Dr Noureddin Sadawi, Dr Larisa Soldatova, Dr Crina Grosan, Prof Ross King, Dr Richard Bickerton, Prof Andrew Hopkins and Dr Willem van Hoorn",
    "default_target_attribute": "pXC50",
    "description": "This dataset contains QSAR data (from ChEMBL version 17) showing activity values (unit is pseudo-pCI50) of several compounds on drug target ChEMBL_ID: CHEMBL2344 (TID: 12720), and it has 21 rows and 1090 features (not including molecule IDs and class feature: molecule_id and pXC50). The features represent Molecular Descriptors which were generated from SMILES strings. Missing value imputation was applied to this dataset (By choosing the Median).",
    "description_version": "1",
    "file_id": "3692666",
    "format": "ARFF",
    "id": "40285",
    "licence": "Public",
    "md5_checksum": "77600bd03c218f610ce0e46644503671",
    "minio_url": "https://data.openml.org/datasets/0004/40285/dataset_40285.pq",
    "name": "QSAR-DATASET-FOR-DRUG-TARGET-CHEMBL2344",
    "original_data_url": "https://www.ebi.ac.uk/chembl/target/inspect/CHEMBL2344",
    "parquet_url": "https://data.openml.org/datasets/0004/40285/dataset_40285.pq",
    "processing_date": "2018-10-04 06:59:09",
    "row_id_attribute": "molecule_id",
    "status": "deactivated",
    "tag": [
      "MetaQSAR",
      "study_13"
    ],
    "upload_date": "2016-07-16T10:55:44",
    "url": "https://api.openml.org/data/v1/download/3692666/QSAR-DATASET-FOR-DRUG-TARGET-CHEMBL2344.arff",
    "version": "12",
    "visibility": "public"
  }
}